BDBM50182855 CHEMBL381296::N-(5-(3-(1-acetylpiperazine-4-carbonyl)-4,5-dimethylbenzylthio)thiazol-2-yl)-5-((3,3-dimethylbutan-2-ylamino)methyl)-1H-pyrrole-2-carboxamide
SMILES: CC(NCc1ccc([nH]1)C(=O)Nc1ncc(SCc2cc(C)c(C)c(c2)C(=O)N2CCN(CC2)C(C)=O)s1)C(C)(C)C
InChI Key: InChIKey=QTCWXZNSCOYHQN-UHFFFAOYSA-N
Data: 2 IC50
Activity Spreadsheet -- Enzyme Inhibition Constant Data from BindingDB
Found 2 hits for monomerid = 50182855
Trg + Lig
Ki
nM
ΔG°
kcal/mole
IC50
nM
Kd
nM
EC50/IC50
nM
koff
s-1
kon
M-1s-1
pHTemp
°C
Tyrosine-protein kinase ITK/TSK
(Homo sapiens (Human))
BDBM50182855
(CHEMBL381296 | N-(5-(3-(1-acetylpiperazine-4-carbo...)
Show SMILES CC(NCc1ccc([nH]1)C(=O)Nc1ncc(SCc2cc(C)c(C)c(c2)C(=O)N2CCN(CC2)C(C)=O)s1)C(C)(C)C
Show InChI InChI=1S/C31H42N6O3S2/c1-19-14-23(15-25(20(19)2)29(40)37-12-10-36(11-13-37)22(4)38)18-41-27-17-33-30(42-27)35-28(39)26-9-8-24(34-26)16-32-21(3)31(5,6)7/h8-9,14-15,17,21,32,34H,10-13,16,18H2,1-7H3,(H,33,35,39)
Reactome pathway
n/an/a 700n/an/an/an/an/an/a
Bristol-Myers Squibb Pharmaceutical Research Institute
Curated by ChEMBL
Assay Description
Inhibition of anti-CD3 antibody-induced IL2 production in human jurkat T cells
Bioorg Med Chem Lett 16: 2411-5 (2006)
Article DOI: 10.1016/j.bmcl.2006.01.115
BindingDB Entry DOI: 10.7270/Q2Z60NNR
Tyrosine-protein kinase ITK/TSK
(Homo sapiens (Human))
BDBM50182855
(CHEMBL381296 | N-(5-(3-(1-acetylpiperazine-4-carbo...)
Show SMILES CC(NCc1ccc([nH]1)C(=O)Nc1ncc(SCc2cc(C)c(C)c(c2)C(=O)N2CCN(CC2)C(C)=O)s1)C(C)(C)C
Show InChI InChI=1S/C31H42N6O3S2/c1-19-14-23(15-25(20(19)2)29(40)37-12-10-36(11-13-37)22(4)38)18-41-27-17-33-30(42-27)35-28(39)26-9-8-24(34-26)16-32-21(3)31(5,6)7/h8-9,14-15,17,21,32,34H,10-13,16,18H2,1-7H3,(H,33,35,39)
Reactome pathway
n/an/a 35n/an/an/an/an/an/a
Bristol-Myers Squibb Pharmaceutical Research Institute
Curated by ChEMBL
Assay Description
Inhibition of Itk
Bioorg Med Chem Lett 16: 2411-5 (2006)
Article DOI: 10.1016/j.bmcl.2006.01.115
BindingDB Entry DOI: 10.7270/Q2Z60NNR