BDBM50183025 CHEMBL3818533
SMILES: Cc1cc(ccc1C(=O)NC1CC1)-c1cnn2c(NCC3CCOCC3)nc(OC3CCCC3)nc12
InChI Key: InChIKey=YFFKKFUHMYUTHX-UHFFFAOYSA-N
Data: 1 IC50
Activity Spreadsheet -- Enzyme Inhibition Constant Data from BindingDB
Found 1 hit for monomerid = 50183025
Trg + Lig
Ki
nM
ΔG°
kcal/mole
IC50
nM
Kd
nM
EC50/IC50
nM
koff
s-1
kon
M-1s-1
pHTemp
°C
Dual specificity protein kinase TTK
(Homo sapiens (Human))
BDBM50183025
(CHEMBL3818533)
Show SMILES Cc1cc(ccc1C(=O)NC1CC1)-c1cnn2c(NCC3CCOCC3)nc(OC3CCCC3)nc12
Show InChI InChI=1S/C27H34N6O3/c1-17-14-19(6-9-22(17)25(34)30-20-7-8-20)23-16-29-33-24(23)31-27(36-21-4-2-3-5-21)32-26(33)28-15-18-10-12-35-13-11-18/h6,9,14,16,18,20-21H,2-5,7-8,10-13,15H2,1H3,(H,30,34)(H,28,31,32)
n/an/a 2.30n/an/an/an/an/an/a
EntreMed Inc.
Curated by ChEMBL
Assay Description
Inhibition of TTK (unknown origin)
Bioorg Med Chem Lett 26: 3562-6 (2016)
BindingDB Entry DOI: 10.7270/Q28G8NNB