BDBM50183069 (2S,4R)-2-[2-(4-chlorophenyl)ethyl]-2-[(1H-imidazol-1-yl)-methyl]-4-methyl-1,3-dioxolane hydrochloride::1-(((2S,4R)-2-(4-chlorophenethyl)-4-methyl-1,3-dioxolan-2-yl)methyl)-1H-imidazole hydrochloride::CHEMBL552550
SMILES: C[C@@H]1CO[C@](CCc2ccc(Cl)cc2)(Cn2ccnc2)O1
InChI Key: InChIKey=PUVVRSXPYYFNAP-CJNGLKHVSA-N
Data: 4 IC50
Activity Spreadsheet -- Enzyme Inhibition Constant Data from BindingDB
Found 4 hits for monomerid = 50183069
Trg + Lig
Ki
nM
ΔG°
kcal/mole
IC50
nM
Kd
nM
EC50/IC50
nM
koff
s-1
kon
M-1s-1
pHTemp
°C
Cytochrome P450 2E1
(Rattus norvegicus (rat))
BDBM50183069
((2S,4R)-2-[2-(4-chlorophenyl)ethyl]-2-[(1H-imidazo...)
Show SMILES C[C@@H]1CO[C@](CCc2ccc(Cl)cc2)(Cn2ccnc2)O1
Show InChI InChI=1S/C16H19ClN2O2/c1-13-10-20-16(21-13,11-19-9-8-18-12-19)7-6-14-2-4-15(17)5-3-14/h2-5,8-9,12-13H,6-7,10-11H2,1H3/t13-,16+/m1/s1
Reactome pathway
n/an/a 3.00E+4n/an/an/an/an/an/a
Queen's University
Curated by ChEMBL
Assay Description
Inhibition of rat liver CYP2E1
J Med Chem 49: 4437-41 (2006)
Article DOI: 10.1021/jm0511435
BindingDB Entry DOI: 10.7270/Q2GH9JR1
Heme Oxygenase 2 (HO-2)
(Rattus norvegicus (rat))
BDBM50183069
((2S,4R)-2-[2-(4-chlorophenyl)ethyl]-2-[(1H-imidazo...)
Show SMILES C[C@@H]1CO[C@](CCc2ccc(Cl)cc2)(Cn2ccnc2)O1
Show InChI InChI=1S/C16H19ClN2O2/c1-13-10-20-16(21-13,11-19-9-8-18-12-19)7-6-14-2-4-15(17)5-3-14/h2-5,8-9,12-13H,6-7,10-11H2,1H3/t13-,16+/m1/s1
Reactome pathway
n/an/a>1.00E+5n/an/an/an/an/an/a
Queen's University
Curated by ChEMBL
Assay Description
Inhibition of Sprague-Dawley rat brain HO2
J Med Chem 49: 4437-41 (2006)
Article DOI: 10.1021/jm0511435
BindingDB Entry DOI: 10.7270/Q2GH9JR1
Heme Oxygenase 1 (HO-1)
(Rattus norvegicus (rat))
BDBM50183069
((2S,4R)-2-[2-(4-chlorophenyl)ethyl]-2-[(1H-imidazo...)
Show SMILES C[C@@H]1CO[C@](CCc2ccc(Cl)cc2)(Cn2ccnc2)O1
Show InChI InChI=1S/C16H19ClN2O2/c1-13-10-20-16(21-13,11-19-9-8-18-12-19)7-6-14-2-4-15(17)5-3-14/h2-5,8-9,12-13H,6-7,10-11H2,1H3/t13-,16+/m1/s1
Reactome pathway
n/an/a 2.00E+4n/an/an/an/an/an/a
Queen's University
Curated by ChEMBL
Assay Description
Inhibition of Sprague-Dawley rat spleen HO1
J Med Chem 49: 4437-41 (2006)
Article DOI: 10.1021/jm0511435
BindingDB Entry DOI: 10.7270/Q2GH9JR1
3D
3D Structure (docked)
Nitric-oxide synthase, brain
(Rattus norvegicus (rat))
BDBM50183069
((2S,4R)-2-[2-(4-chlorophenyl)ethyl]-2-[(1H-imidazo...)
Show SMILES C[C@@H]1CO[C@](CCc2ccc(Cl)cc2)(Cn2ccnc2)O1
Show InChI InChI=1S/C16H19ClN2O2/c1-13-10-20-16(21-13,11-19-9-8-18-12-19)7-6-14-2-4-15(17)5-3-14/h2-5,8-9,12-13H,6-7,10-11H2,1H3/t13-,16+/m1/s1
n/an/a>5.00E+5n/an/an/an/an/an/a
Queen's University
Curated by ChEMBL
Assay Description
Inhibition of rat brain nNOS
J Med Chem 49: 4437-41 (2006)
Article DOI: 10.1021/jm0511435
BindingDB Entry DOI: 10.7270/Q2GH9JR1