BDBM50183080 1-(4-butylphenyl)-4-(4-(hydroxydiphenylmethyl)piperidin-1-yl)butan-1-one::CHEMBL207832
SMILES: CCCCc1ccc(cc1)C(=O)CCCN1CCC(CC1)C(O)(c1ccccc1)c1ccccc1
InChI Key: InChIKey=QGDPYJHGPFUYJB-UHFFFAOYSA-N
Data: 1 IC50
Activity Spreadsheet -- Enzyme Inhibition Constant Data from BindingDB
Found 1 hit for monomerid = 50183080
Trg + Lig
Ki
nM
ΔG°
kcal/mole
IC50
nM
Kd
nM
EC50/IC50
nM
koff
s-1
kon
M-1s-1
pHTemp
°C
Cytochrome P450 2J2
(Homo sapiens (Human))
BDBM50183080
(1-(4-butylphenyl)-4-(4-(hydroxydiphenylmethyl)pipe...)
Show SMILES CCCCc1ccc(cc1)C(=O)CCCN1CCC(CC1)C(O)(c1ccccc1)c1ccccc1
Show InChI InChI=1S/C32H39NO2/c1-2-3-11-26-17-19-27(20-18-26)31(34)16-10-23-33-24-21-30(22-25-33)32(35,28-12-6-4-7-13-28)29-14-8-5-9-15-29/h4-9,12-15,17-20,30,35H,2-3,10-11,16,21-25H2,1H3
n/an/a 700n/an/an/an/an/an/a
Universite Paris 5 René Descartes
Curated by ChEMBL
Assay Description
Inhibition of human recombinant CYP2J2 expressed in baculovirus-infected Sf9 insect cells
Bioorg Med Chem Lett 16: 2777-80 (2006)
Article DOI: 10.1016/j.bmcl.2006.02.004
BindingDB Entry DOI: 10.7270/Q21Z440R