BDBM50183184 3-(2-(2-(benzyloxy)-5-chlorophenyl)-1H-pyrrol-1-yl)benzoic acid::CHEMBL383090
SMILES: OC(=O)c1cccc(c1)-n1cccc1-c1cc(Cl)ccc1OCc1ccccc1
InChI Key: InChIKey=SMRMPFQENVWDPO-UHFFFAOYSA-N
Data: 1 IC50
Activity Spreadsheet -- Enzyme Inhibition Constant Data from BindingDB
Found 1 hit for monomerid = 50183184
Trg + Lig
Ki
nM
ΔG°
kcal/mole
IC50
nM
Kd
nM
EC50/IC50
nM
koff
s-1
kon
M-1s-1
pHTemp
°C
Cytochrome P450 2C9
(Homo sapiens (Human))
BDBM50183184
(3-(2-(2-(benzyloxy)-5-chlorophenyl)-1H-pyrrol-1-yl...)
Show SMILES OC(=O)c1cccc(c1)-n1cccc1-c1cc(Cl)ccc1OCc1ccccc1
Show InChI InChI=1S/C24H18ClNO3/c25-19-11-12-23(29-16-17-6-2-1-3-7-17)21(15-19)22-10-5-13-26(22)20-9-4-8-18(14-20)24(27)28/h1-15H,16H2,(H,27,28)
Reactome pathway
n/an/a 7.30E+3n/an/an/an/an/an/a
GlaxoSmithKline
Curated by ChEMBL
Assay Description
Inhibition of CYP450 2C9
Bioorg Med Chem Lett 16: 2666-71 (2006)
Article DOI: 10.1016/j.bmcl.2006.02.014
BindingDB Entry DOI: 10.7270/Q2J102RM