BDBM50183189 3-(3-(2-(benzyloxy)-5-chlorophenyl)pyridin-4-yl)benzoic acid::CHEMBL209244
SMILES: OC(=O)c1cccc(c1)-c1ccncc1-c1cc(Cl)ccc1OCc1ccccc1
InChI Key: InChIKey=WSTSJUHYFOKDQM-UHFFFAOYSA-N
Data: 2 IC50
Activity Spreadsheet -- Enzyme Inhibition Constant Data from BindingDB
Found 2 hits for monomerid = 50183189
Trg + Lig
Ki
nM
ΔG°
kcal/mole
IC50
nM
Kd
nM
EC50/IC50
nM
koff
s-1
kon
M-1s-1
pHTemp
°C
Cytochrome P450 3A4
(Homo sapiens (Human))
BDBM50183189
(3-(3-(2-(benzyloxy)-5-chlorophenyl)pyridin-4-yl)be...)
Show SMILES OC(=O)c1cccc(c1)-c1ccncc1-c1cc(Cl)ccc1OCc1ccccc1
Show InChI InChI=1S/C25H18ClNO3/c26-20-9-10-24(30-16-17-5-2-1-3-6-17)22(14-20)23-15-27-12-11-21(23)18-7-4-8-19(13-18)25(28)29/h1-15H,16H2,(H,28,29)
Reactome pathway
n/an/a 1.40E+3n/an/an/an/an/an/a
GlaxoSmithKline
Curated by ChEMBL
Assay Description
Inhibition of CYP450 3A4
Bioorg Med Chem Lett 16: 2666-71 (2006)
Article DOI: 10.1016/j.bmcl.2006.02.014
BindingDB Entry DOI: 10.7270/Q2J102RM
Cytochrome P450 2C9
(Homo sapiens (Human))
BDBM50183189
(3-(3-(2-(benzyloxy)-5-chlorophenyl)pyridin-4-yl)be...)
Show SMILES OC(=O)c1cccc(c1)-c1ccncc1-c1cc(Cl)ccc1OCc1ccccc1
Show InChI InChI=1S/C25H18ClNO3/c26-20-9-10-24(30-16-17-5-2-1-3-6-17)22(14-20)23-15-27-12-11-21(23)18-7-4-8-19(13-18)25(28)29/h1-15H,16H2,(H,28,29)
Reactome pathway
n/an/a 4.30E+3n/an/an/an/an/an/a
GlaxoSmithKline
Curated by ChEMBL
Assay Description
Inhibition of CYP450 2C9
Bioorg Med Chem Lett 16: 2666-71 (2006)
Article DOI: 10.1016/j.bmcl.2006.02.014
BindingDB Entry DOI: 10.7270/Q2J102RM