null
SMILES: Cc1ccc(c(Br)c1)-n1nnnc1SCC(=O)Nc1ccccc1[N+]([O-])=O
InChI Key: InChIKey=YRMVKPSVXTVSAU-UHFFFAOYSA-N
Activity Spreadsheet -- Enzyme Inhibition Constant Data from BindingDB
Found 1 hit for monomerid = 50183190
Trg + Lig
Ki
nM
ΔG°
kcal/mole
IC50
nM
Kd
nM
EC50/IC50
nM
koff
s-1
kon
M-1s-1
pHTemp
°C
Reverse transcriptase/RNaseH
(Human immunodeficiency virus 1)
BDBM50183190
(2-(1-(2-bromo-4-methylphenyl)-1H-tetrazol-5-ylthio...)
Show SMILES Cc1ccc(c(Br)c1)-n1nnnc1SCC(=O)Nc1ccccc1[N+]([O-])=O
Show InChI InChI=1S/C16H13BrN6O3S/c1-10-6-7-13(11(17)8-10)22-16(19-20-21-22)27-9-15(24)18-12-4-2-3-5-14(12)23(25)26/h2-8H,9H2,1H3,(H,18,24)
n/an/a 3n/an/an/an/an/an/a
MRL Rome
Curated by ChEMBL
Assay Description
Inhibition of HIV1 wild type Reverse Transcriptase
Bioorg Med Chem Lett 16: 2748-52 (2006)
Article DOI: 10.1016/j.bmcl.2006.02.024
BindingDB Entry DOI: 10.7270/Q2D79B1R