BDBM50183198 3-chloro-N-(3-(dimethylamino)propyl)-4-(2-(1-mesityl-1H-tetrazol-5-ylthio)acetamido)benzamide::CHEMBL207920
SMILES: CN(C)CCCNC(=O)c1ccc(NC(=O)CSc2nnnn2-c2c(C)cc(C)cc2C)c(Cl)c1
InChI Key: InChIKey=OXTPSDDMJCCDJL-UHFFFAOYSA-N
Data: 1 IC50
Activity Spreadsheet -- Enzyme Inhibition Constant Data from BindingDB
Found 1 hit for monomerid = 50183198
Trg + Lig
Ki
nM
ΔG°
kcal/mole
IC50
nM
Kd
nM
EC50/IC50
nM
koff
s-1
kon
M-1s-1
pHTemp
°C
Reverse transcriptase/RNaseH
(Human immunodeficiency virus 1)
BDBM50183198
(3-chloro-N-(3-(dimethylamino)propyl)-4-(2-(1-mesit...)
Show SMILES CN(C)CCCNC(=O)c1ccc(NC(=O)CSc2nnnn2-c2c(C)cc(C)cc2C)c(Cl)c1 |(11.95,-30.47,;10.62,-29.7,;10.62,-28.16,;9.29,-30.47,;7.95,-29.7,;6.62,-30.47,;5.29,-29.7,;3.95,-30.47,;3.95,-32.01,;2.62,-29.7,;1.28,-30.47,;-.05,-29.69,;-.04,-28.15,;-1.37,-27.38,;-2.71,-28.15,;-2.71,-29.69,;-4.04,-27.38,;-5.38,-28.14,;-6.71,-27.37,;-6.86,-25.84,;-8.37,-25.51,;-9.14,-26.84,;-8.12,-28,;-8.44,-29.5,;-9.91,-29.97,;-11.04,-28.93,;-10.24,-31.48,;-9.1,-32.52,;-9.43,-34.02,;-7.63,-32.05,;-7.3,-30.54,;-5.84,-30.07,;1.28,-27.38,;1.28,-25.84,;2.62,-28.15,)|
Show InChI InChI=1S/C24H30ClN7O2S/c1-15-11-16(2)22(17(3)12-15)32-24(28-29-30-32)35-14-21(33)27-20-8-7-18(13-19(20)25)23(34)26-9-6-10-31(4)5/h7-8,11-13H,6,9-10,14H2,1-5H3,(H,26,34)(H,27,33)
n/an/a 5n/an/an/an/an/an/a
MRL Rome
Curated by ChEMBL
Assay Description
Inhibition of HIV1 wild type Reverse Transcriptase
Bioorg Med Chem Lett 16: 2748-52 (2006)
Article DOI: 10.1016/j.bmcl.2006.02.024
BindingDB Entry DOI: 10.7270/Q2D79B1R