BDBM50183211 CHEMBL205152::N-(4-chloro-2-nitrophenyl)-2-(1-mesityl-1H-tetrazol-5-ylthio)acetamide
SMILES: Cc1cc(C)c(c(C)c1)-n1nnnc1SCC(=O)Nc1ccc(Cl)cc1[N+]([O-])=O
InChI Key: InChIKey=AGSVTLZNGJQSKY-UHFFFAOYSA-N
Data: 1 IC50
Activity Spreadsheet -- Enzyme Inhibition Constant Data from BindingDB
Found 1 hit for monomerid = 50183211
Trg + Lig
Ki
nM
ΔG°
kcal/mole
IC50
nM
Kd
nM
EC50/IC50
nM
koff
s-1
kon
M-1s-1
pHTemp
°C
Human immunodeficiency virus type 1 reverse transcriptase
(Human immunodeficiency virus 1)
BDBM50183211
(CHEMBL205152 | N-(4-chloro-2-nitrophenyl)-2-(1-mes...)
Show SMILES Cc1cc(C)c(c(C)c1)-n1nnnc1SCC(=O)Nc1ccc(Cl)cc1[N+]([O-])=O |(-7.25,-49.05,;-6.92,-47.54,;-8.05,-46.5,;-7.72,-45,;-8.86,-43.96,;-6.26,-44.53,;-5.12,-45.56,;-3.65,-45.09,;-5.45,-47.08,;-5.93,-43.02,;-6.96,-41.87,;-6.18,-40.54,;-4.68,-40.86,;-4.52,-42.4,;-3.19,-43.17,;-1.86,-42.4,;-.52,-43.17,;-.53,-44.71,;.81,-42.41,;2.14,-43.18,;2.14,-44.72,;3.47,-45.49,;4.8,-44.72,;6.14,-45.5,;4.8,-43.18,;3.47,-42.41,;3.47,-40.86,;4.8,-40.09,;2.13,-40.09,)|
Show InChI InChI=1S/C18H17ClN6O3S/c1-10-6-11(2)17(12(3)7-10)24-18(21-22-23-24)29-9-16(26)20-14-5-4-13(19)8-15(14)25(27)28/h4-8H,9H2,1-3H3,(H,20,26)
n/an/a 4n/an/an/an/an/an/a
MRL Rome
Curated by ChEMBL
Assay Description
Inhibition of HIV1 wild type Reverse Transcriptase
Bioorg Med Chem Lett 16: 2748-52 (2006)
Article DOI: 10.1016/j.bmcl.2006.02.024
BindingDB Entry DOI: 10.7270/Q2D79B1R