null
SMILES: OC(c1ccc(cc1)C(=O)N1CCCC1)(C(F)(F)F)C(F)(F)F
InChI Key: InChIKey=DZPRZIZTCNWQFO-UHFFFAOYSA-N
Activity Spreadsheet -- Enzyme Inhibition Constant Data from BindingDB
Found 1 hit for monomerid = 50183290
Trg + Lig
Ki
nM
ΔG°
kcal/mole
IC50
nM
Kd
nM
EC50/IC50
nM
koff
s-1
kon
M-1s-1
pHTemp
°C
Malonyl-CoA decarboxylase, mitochondrial
(Homo sapiens (Human))
BDBM50183290
(CHEMBL205506 | pyrrolidin-1-yl-[4-(2,2,2-trifluoro...)
Show SMILES OC(c1ccc(cc1)C(=O)N1CCCC1)(C(F)(F)F)C(F)(F)F
Show InChI InChI=1S/C14H13F6NO2/c15-13(16,17)12(23,14(18,19)20)10-5-3-9(4-6-10)11(22)21-7-1-2-8-21/h3-6,23H,1-2,7-8H2
Reactome pathway
n/an/a 0.850n/an/an/an/an/an/a
Chugai Pharma USA, LLC.
Curated by ChEMBL
Assay Description
Inhibition of MCD
J Med Chem 49: 1517-25 (2006)
Article DOI: 10.1021/jm050109n
BindingDB Entry DOI: 10.7270/Q2C828XZ