BDBM50183383 CHEMBL3818547
SMILES: COc1cc2ncnc(Nc3ccc(F)c(Cl)c3)c2cc1NC(=O)[C@@H]1COC(=O)N1
InChI Key: InChIKey=DJAUDRYHVNOPNC-HNNXBMFYSA-N
Data: 3 IC50
Activity Spreadsheet -- Enzyme Inhibition Constant Data from BindingDB
Found 3 hits for monomerid = 50183383
Trg + Lig
Ki
nM
ΔG°
kcal/mole
IC50
nM
Kd
nM
EC50/IC50
nM
koff
s-1
kon
M-1s-1
pHTemp
°C
Epidermal growth factor receptor
(Homo sapiens (Human))
BDBM50183383
(CHEMBL3818547)
Show SMILES COc1cc2ncnc(Nc3ccc(F)c(Cl)c3)c2cc1NC(=O)[C@@H]1COC(=O)N1 |r|
Show InChI InChI=1S/C19H15ClFN5O4/c1-29-16-6-13-10(5-14(16)25-18(27)15-7-30-19(28)26-15)17(23-8-22-13)24-9-2-3-12(21)11(20)4-9/h2-6,8,15H,7H2,1H3,(H,25,27)(H,26,28)(H,22,23,24)/t15-/m0/s1
n/an/a 1.10n/an/an/an/an/an/a
Zhejiang University
Curated by ChEMBL
Assay Description
Inhibition of wild type human EGFR preincubated for 5 mins followed by ATP addition for 30 mins by HTRF assay
Bioorg Med Chem 24: 3359-70 (2016)
BindingDB Entry DOI: 10.7270/Q2H133ZJ
Epidermal growth factor receptor
(Homo sapiens (Human))
BDBM50183383
(CHEMBL3818547)
Show SMILES COc1cc2ncnc(Nc3ccc(F)c(Cl)c3)c2cc1NC(=O)[C@@H]1COC(=O)N1 |r|
Show InChI InChI=1S/C19H15ClFN5O4/c1-29-16-6-13-10(5-14(16)25-18(27)15-7-30-19(28)26-15)17(23-8-22-13)24-9-2-3-12(21)11(20)4-9/h2-6,8,15H,7H2,1H3,(H,25,27)(H,26,28)(H,22,23,24)/t15-/m0/s1
n/an/a 26n/an/an/an/an/an/a
Zhejiang University
Curated by ChEMBL
Assay Description
Inhibition of EGFR T790M mutant (unknown origin) preincubated for 5 mins followed by ATP addition for 30 mins by HTRF assay
Bioorg Med Chem 24: 3359-70 (2016)
BindingDB Entry DOI: 10.7270/Q2H133ZJ
Epidermal growth factor receptor
(Homo sapiens (Human))
BDBM50183383
(CHEMBL3818547)
Show SMILES COc1cc2ncnc(Nc3ccc(F)c(Cl)c3)c2cc1NC(=O)[C@@H]1COC(=O)N1 |r|
Show InChI InChI=1S/C19H15ClFN5O4/c1-29-16-6-13-10(5-14(16)25-18(27)15-7-30-19(28)26-15)17(23-8-22-13)24-9-2-3-12(21)11(20)4-9/h2-6,8,15H,7H2,1H3,(H,25,27)(H,26,28)(H,22,23,24)/t15-/m0/s1
n/an/a 0.310n/an/an/an/an/an/a
Zhejiang University
Curated by ChEMBL
Assay Description
Inhibition of recombinant human EGFR L858R mutant expressed in baculovirus infected insect cells preincubated for 5 mins followed by ATP addition for...
Bioorg Med Chem 24: 3359-70 (2016)
BindingDB Entry DOI: 10.7270/Q2H133ZJ