BDBM50183385 CHEMBL203823::N-(2-(furan-2-ylmethylthio)ethyl)-2-(4-hydroxy-6-propylpyrimidin-2-ylthio)acetamide
SMILES: CCCc1cc(=O)[nH]c(SCC(=O)NCCSCc2ccco2)n1
InChI Key: InChIKey=WWZZIWIQTQNJDG-UHFFFAOYSA-N
Data: 2 IC50
Activity Spreadsheet -- Enzyme Inhibition Constant Data from BindingDB
Found 2 hits for monomerid = 50183385
Trg + Lig
Ki
nM
ΔG°
kcal/mole
IC50
nM
Kd
nM
EC50/IC50
nM
koff
s-1
kon
M-1s-1
pHTemp
°C
Falcipain-2
(Plasmodium falciparum)
BDBM50183385
(CHEMBL203823 | N-(2-(furan-2-ylmethylthio)ethyl)-2...)
Show SMILES CCCc1cc(=O)[nH]c(SCC(=O)NCCSCc2ccco2)n1
Show InChI InChI=1S/C16H21N3O3S2/c1-2-4-12-9-14(20)19-16(18-12)24-11-15(21)17-6-8-23-10-13-5-3-7-22-13/h3,5,7,9H,2,4,6,8,10-11H2,1H3,(H,17,21)(H,18,19,20)
n/an/a 4.60E+3n/an/an/an/an/an/a
University of Mississippi
Curated by ChEMBL
Assay Description
Inhibition of falcipain2
J Med Chem 49: 1576-84 (2006)
Article DOI: 10.1021/jm0505765
BindingDB Entry DOI: 10.7270/Q2B27W35
Cysteine protease falcipain-3
(Plasmodium falciparum)
BDBM50183385
(CHEMBL203823 | N-(2-(furan-2-ylmethylthio)ethyl)-2...)
Show SMILES CCCc1cc(=O)[nH]c(SCC(=O)NCCSCc2ccco2)n1
Show InChI InChI=1S/C16H21N3O3S2/c1-2-4-12-9-14(20)19-16(18-12)24-11-15(21)17-6-8-23-10-13-5-3-7-22-13/h3,5,7,9H,2,4,6,8,10-11H2,1H3,(H,17,21)(H,18,19,20)
n/an/a>5.00E+4n/an/an/an/an/an/a
University of Mississippi
Curated by ChEMBL
Assay Description
Inhibition of falcipain3
J Med Chem 49: 1576-84 (2006)
Article DOI: 10.1021/jm0505765
BindingDB Entry DOI: 10.7270/Q2B27W35