null
SMILES: COc1cc2ncnc(Nc3ccc(F)c(Cl)c3)c2cc1NC(=O)[C@H]1NC(=O)O[C@@H]1C
InChI Key: InChIKey=JPUWTGYAJVCPPC-XLFHBGCDSA-N
Activity Spreadsheet -- Enzyme Inhibition Constant Data from BindingDB
Found 3 hits for monomerid = 50183406
Trg + Lig
Ki
nM
ΔG°
kcal/mole
IC50
nM
Kd
nM
EC50/IC50
nM
koff
s-1
kon
M-1s-1
pHTemp
°C
Epidermal growth factor receptor
(Homo sapiens (Human))
BDBM50183406
(CHEMBL3818062)
Show SMILES COc1cc2ncnc(Nc3ccc(F)c(Cl)c3)c2cc1NC(=O)[C@H]1NC(=O)O[C@@H]1C |r|
Show InChI InChI=1S/C20H17ClFN5O4/c1-9-17(27-20(29)31-9)19(28)26-15-6-11-14(7-16(15)30-2)23-8-24-18(11)25-10-3-4-13(22)12(21)5-10/h3-9,17H,1-2H3,(H,26,28)(H,27,29)(H,23,24,25)/t9-,17+/m1/s1
n/an/a 2n/an/an/an/an/an/a
Zhejiang University
Curated by ChEMBL
Assay Description
Inhibition of wild type human EGFR preincubated for 5 mins followed by ATP addition for 30 mins by HTRF assay
Bioorg Med Chem 24: 3359-70 (2016)
BindingDB Entry DOI: 10.7270/Q2H133ZJ
Epidermal growth factor receptor/Receptor tyrosine-protein kinase erbB-2/Receptor tyrosine-protein kinase erbB-3/Receptor tyrosine-protein kinase erbB-4
(Homo sapiens (Human))
BDBM50183406
(CHEMBL3818062)
Show SMILES COc1cc2ncnc(Nc3ccc(F)c(Cl)c3)c2cc1NC(=O)[C@H]1NC(=O)O[C@@H]1C |r|
Show InChI InChI=1S/C20H17ClFN5O4/c1-9-17(27-20(29)31-9)19(28)26-15-6-11-14(7-16(15)30-2)23-8-24-18(11)25-10-3-4-13(22)12(21)5-10/h3-9,17H,1-2H3,(H,26,28)(H,27,29)(H,23,24,25)/t9-,17+/m1/s1
n/an/a 40n/an/an/an/an/an/a
Zhejiang University
Curated by ChEMBL
Assay Description
Inhibition of EGFR T790M mutant (unknown origin) preincubated for 5 mins followed by ATP addition for 30 mins by HTRF assay
Bioorg Med Chem 24: 3359-70 (2016)
BindingDB Entry DOI: 10.7270/Q2H133ZJ
Epidermal growth factor receptor/Receptor tyrosine-protein kinase erbB-2/Receptor tyrosine-protein kinase erbB-3/Receptor tyrosine-protein kinase erbB-4
(Homo sapiens (Human))
BDBM50183406
(CHEMBL3818062)
Show SMILES COc1cc2ncnc(Nc3ccc(F)c(Cl)c3)c2cc1NC(=O)[C@H]1NC(=O)O[C@@H]1C |r|
Show InChI InChI=1S/C20H17ClFN5O4/c1-9-17(27-20(29)31-9)19(28)26-15-6-11-14(7-16(15)30-2)23-8-24-18(11)25-10-3-4-13(22)12(21)5-10/h3-9,17H,1-2H3,(H,26,28)(H,27,29)(H,23,24,25)/t9-,17+/m1/s1
n/an/a 0.350n/an/an/an/an/an/a
Zhejiang University
Curated by ChEMBL
Assay Description
Inhibition of recombinant human EGFR L858R mutant expressed in baculovirus infected insect cells preincubated for 5 mins followed by ATP addition for...
Bioorg Med Chem 24: 3359-70 (2016)
BindingDB Entry DOI: 10.7270/Q2H133ZJ