BDBM50183593 CHEMBL379056::c[RGD-(S)-alpha-TfmfV]
SMILES: [#6]-[#6](-[#6])-[#6@@H]-1-[#7]-[#6](=O)[C@]([#6]-c2ccccc2)([#7]-[#6](=O)-[#6@H](-[#6]-[#6](-[#8])=O)-[#7]-[#6](=O)-[#6]-[#7]-[#6](=O)-[#6@H](-[#6]-[#6]-[#6]\[#7]=[#6](\[#7])-[#7])-[#7]-[#6]-1=O)C(F)(F)F
InChI Key: InChIKey=IIJWLNNXJHIKND-CVJKZBOTSA-N
Data: 2 IC50
Activity Spreadsheet -- Enzyme Inhibition Constant Data from BindingDB
Found 2 hits for monomerid = 50183593
Trg + Lig
Ki
nM
ΔG°
kcal/mole
IC50
nM
Kd
nM
EC50/IC50
nM
koff
s-1
kon
M-1s-1
pHTemp
°C
Integrin alpha-V/beta-5
(Homo sapiens (Human))
BDBM50183593
(CHEMBL379056 | c[RGD-(S)-alpha-TfmfV])
Show SMILES [#6]-[#6](-[#6])-[#6@@H]-1-[#7]-[#6](=O)[C@]([#6]-c2ccccc2)([#7]-[#6](=O)-[#6@H](-[#6]-[#6](-[#8])=O)-[#7]-[#6](=O)-[#6]-[#7]-[#6](=O)-[#6@H](-[#6]-[#6]-[#6]\[#7]=[#6](\[#7])-[#7])-[#7]-[#6]-1=O)C(F)(F)F
Show InChI InChI=1S/C27H37F3N8O7/c1-14(2)20-23(44)36-16(9-6-10-33-25(31)32)21(42)34-13-18(39)35-17(11-19(40)41)22(43)38-26(24(45)37-20,27(28,29)30)12-15-7-4-3-5-8-15/h3-5,7-8,14,16-17,20H,6,9-13H2,1-2H3,(H,34,42)(H,35,39)(H,36,44)(H,37,45)(H,38,43)(H,40,41)(H4,31,32,33)/t16-,17-,20-,26-/m0/s1
NCI pathway
Reactome pathway
n/an/a 10.0n/an/an/an/an/an/a
Istituto di Ricerche Chimiche e Biochimiche G. Ronzoni
Curated by ChEMBL
Assay Description
Displacement of [125I]echistatin from AlphaVbeta5 integrin receptor
J Med Chem 49: 1808-17 (2006)
Article DOI: 10.1021/jm0511334
BindingDB Entry DOI: 10.7270/Q2G160FD
Integrin alpha-V/beta-3
(Homo sapiens (Human))
BDBM50183593
(CHEMBL379056 | c[RGD-(S)-alpha-TfmfV])
Show SMILES [#6]-[#6](-[#6])-[#6@@H]-1-[#7]-[#6](=O)[C@]([#6]-c2ccccc2)([#7]-[#6](=O)-[#6@H](-[#6]-[#6](-[#8])=O)-[#7]-[#6](=O)-[#6]-[#7]-[#6](=O)-[#6@H](-[#6]-[#6]-[#6]\[#7]=[#6](\[#7])-[#7])-[#7]-[#6]-1=O)C(F)(F)F
Show InChI InChI=1S/C27H37F3N8O7/c1-14(2)20-23(44)36-16(9-6-10-33-25(31)32)21(42)34-13-18(39)35-17(11-19(40)41)22(43)38-26(24(45)37-20,27(28,29)30)12-15-7-4-3-5-8-15/h3-5,7-8,14,16-17,20H,6,9-13H2,1-2H3,(H,34,42)(H,35,39)(H,36,44)(H,37,45)(H,38,43)(H,40,41)(H4,31,32,33)/t16-,17-,20-,26-/m0/s1
n/an/a 237n/an/an/an/an/an/a
Istituto di Ricerche Chimiche e Biochimiche G. Ronzoni
Curated by ChEMBL
Assay Description
Displacement of [125I]echistatin from AlphaVbeta3 integrin receptor
J Med Chem 49: 1808-17 (2006)
Article DOI: 10.1021/jm0511334
BindingDB Entry DOI: 10.7270/Q2G160FD