BDBM50183785 (S)-1-((2S,3S)-3-(hydroxycarbamoyl)-2-(4-methoxyphenyl)pentanoyl)-N-methylpiperidine-2-carboxamide::CHEMBL207756
SMILES: CC[C@@H]([C@H](C(=O)N1CCCC[C@H]1C(=O)NC)c1ccc(OC)cc1)C(=O)NO
InChI Key: InChIKey=ZQORGANDVNQVJF-YESZJQIVSA-N
Data: 4 KI  1 IC50
Activity Spreadsheet -- Enzyme Inhibition Constant Data from BindingDB
Found 5 hits for monomerid = 50183785
Trg + Lig
Ki
nM
ΔG°
kcal/mole
IC50
nM
Kd
nM
EC50/IC50
nM
koff
s-1
kon
M-1s-1
pHTemp
°C
Collagenase 3
(Homo sapiens (Human))
BDBM50183785
((S)-1-((2S,3S)-3-(hydroxycarbamoyl)-2-(4-methoxyph...)
Show SMILES CC[C@@H]([C@H](C(=O)N1CCCC[C@H]1C(=O)NC)c1ccc(OC)cc1)C(=O)NO
Show InChI InChI=1S/C20H29N3O5/c1-4-15(18(24)22-27)17(13-8-10-14(28-3)11-9-13)20(26)23-12-6-5-7-16(23)19(25)21-2/h8-11,15-17,27H,4-7,12H2,1-3H3,(H,21,25)(H,22,24)/t15-,16-,17+/m0/s1
NCI pathway
Reactome pathway
7n/an/an/an/an/an/an/an/a
Novartis Institutes for BioMedical Research
Curated by ChEMBL
Assay Description
Binding affinity to recombinant MMP13
Bioorg Med Chem Lett 16: 2632-6 (2006)
Article DOI: 10.1016/j.bmcl.2006.02.042
BindingDB Entry DOI: 10.7270/Q2JS9Q12
Disintegrin and metalloproteinase domain-containing protein 17
(Homo sapiens (Human))
BDBM50183785
((S)-1-((2S,3S)-3-(hydroxycarbamoyl)-2-(4-methoxyph...)
Show SMILES CC[C@@H]([C@H](C(=O)N1CCCC[C@H]1C(=O)NC)c1ccc(OC)cc1)C(=O)NO
Show InChI InChI=1S/C20H29N3O5/c1-4-15(18(24)22-27)17(13-8-10-14(28-3)11-9-13)20(26)23-12-6-5-7-16(23)19(25)21-2/h8-11,15-17,27H,4-7,12H2,1-3H3,(H,21,25)(H,22,24)/t15-,16-,17+/m0/s1
Reactome pathway
8n/an/an/an/an/an/an/an/a
Novartis Institutes for BioMedical Research
Curated by ChEMBL
Assay Description
Binding affinity to recombinant TACE
Bioorg Med Chem Lett 16: 2632-6 (2006)
Article DOI: 10.1016/j.bmcl.2006.02.042
BindingDB Entry DOI: 10.7270/Q2JS9Q12
Stromelysin-1
(Homo sapiens (Human))
BDBM50183785
((S)-1-((2S,3S)-3-(hydroxycarbamoyl)-2-(4-methoxyph...)
Show SMILES CC[C@@H]([C@H](C(=O)N1CCCC[C@H]1C(=O)NC)c1ccc(OC)cc1)C(=O)NO
Show InChI InChI=1S/C20H29N3O5/c1-4-15(18(24)22-27)17(13-8-10-14(28-3)11-9-13)20(26)23-12-6-5-7-16(23)19(25)21-2/h8-11,15-17,27H,4-7,12H2,1-3H3,(H,21,25)(H,22,24)/t15-,16-,17+/m0/s1
Reactome pathway
11n/an/an/an/an/an/an/an/a
Novartis Institutes for BioMedical Research
Curated by ChEMBL
Assay Description
Binding affinity to recombinant MMP3
Bioorg Med Chem Lett 16: 2632-6 (2006)
Article DOI: 10.1016/j.bmcl.2006.02.042
BindingDB Entry DOI: 10.7270/Q2JS9Q12
Interstitial collagenase
(Homo sapiens (Human))
BDBM50183785
((S)-1-((2S,3S)-3-(hydroxycarbamoyl)-2-(4-methoxyph...)
Show SMILES CC[C@@H]([C@H](C(=O)N1CCCC[C@H]1C(=O)NC)c1ccc(OC)cc1)C(=O)NO
Show InChI InChI=1S/C20H29N3O5/c1-4-15(18(24)22-27)17(13-8-10-14(28-3)11-9-13)20(26)23-12-6-5-7-16(23)19(25)21-2/h8-11,15-17,27H,4-7,12H2,1-3H3,(H,21,25)(H,22,24)/t15-,16-,17+/m0/s1
Reactome pathway
25n/an/an/an/an/an/an/an/a
Novartis Institutes for BioMedical Research
Curated by ChEMBL
Assay Description
Binding affinity to recombinant MMP1
Bioorg Med Chem Lett 16: 2632-6 (2006)
Article DOI: 10.1016/j.bmcl.2006.02.042
BindingDB Entry DOI: 10.7270/Q2JS9Q12
Disintegrin and metalloproteinase domain-containing protein 17
(Homo sapiens (Human))
BDBM50183785
((S)-1-((2S,3S)-3-(hydroxycarbamoyl)-2-(4-methoxyph...)
Show SMILES CC[C@@H]([C@H](C(=O)N1CCCC[C@H]1C(=O)NC)c1ccc(OC)cc1)C(=O)NO
Show InChI InChI=1S/C20H29N3O5/c1-4-15(18(24)22-27)17(13-8-10-14(28-3)11-9-13)20(26)23-12-6-5-7-16(23)19(25)21-2/h8-11,15-17,27H,4-7,12H2,1-3H3,(H,21,25)(H,22,24)/t15-,16-,17+/m0/s1
Reactome pathway
n/an/a 836n/an/an/an/an/an/a
Novartis Institutes for BioMedical Research
Curated by ChEMBL
Assay Description
Inhibition of LPS/interferon gamma-stimulated TNFalpha release from HPBMC
Bioorg Med Chem Lett 16: 2632-6 (2006)
Article DOI: 10.1016/j.bmcl.2006.02.042
BindingDB Entry DOI: 10.7270/Q2JS9Q12