BDBM50183844 (S)-2-(((4-(3-chloro-2-fluorophenylamino)-7-methoxyquinazolin-6-yl)methyl)(methyl)amino)-3-hydroxypropanamide::CHEMBL208286
SMILES: COc1cc2ncnc(Nc3cccc(Cl)c3F)c2cc1CN(C)[C@@H](CO)C(N)=O
InChI Key: InChIKey=PFMSFEQGLHGUNF-INIZCTEOSA-N
Data: 13 IC50
Activity Spreadsheet -- Enzyme Inhibition Constant Data from BindingDB
Found 13 hits for monomerid = 50183844
Trg + Lig
Ki
nM
ΔG°
kcal/mole
IC50
nM
Kd
nM
EC50/IC50
nM
koff
s-1
kon
M-1s-1
pHTemp
°C
Mitogen-activated protein kinase 10/8/9
(Homo sapiens (Human))
BDBM50183844
((S)-2-(((4-(3-chloro-2-fluorophenylamino)-7-methox...)
Show SMILES COc1cc2ncnc(Nc3cccc(Cl)c3F)c2cc1CN(C)[C@@H](CO)C(N)=O
Show InChI InChI=1S/C20H21ClFN5O3/c1-27(16(9-28)19(23)29)8-11-6-12-15(7-17(11)30-2)24-10-25-20(12)26-14-5-3-4-13(21)18(14)22/h3-7,10,16,28H,8-9H2,1-2H3,(H2,23,29)(H,24,25,26)/t16-/m0/s1
NCI pathway
Reactome pathway
n/an/a>1.00E+4n/an/an/an/an/an/a
Centre de Recherches
Curated by ChEMBL
Assay Description
Inhibition of JNK
Bioorg Med Chem Lett 16: 2672-6 (2006)
Article DOI: 10.1016/j.bmcl.2006.02.025
BindingDB Entry DOI: 10.7270/Q25H7FVK
Rho-associated protein kinase 2
(Homo sapiens (Human))
BDBM50183844
((S)-2-(((4-(3-chloro-2-fluorophenylamino)-7-methox...)
Show SMILES COc1cc2ncnc(Nc3cccc(Cl)c3F)c2cc1CN(C)[C@@H](CO)C(N)=O
Show InChI InChI=1S/C20H21ClFN5O3/c1-27(16(9-28)19(23)29)8-11-6-12-15(7-17(11)30-2)24-10-25-20(12)26-14-5-3-4-13(21)18(14)22/h3-7,10,16,28H,8-9H2,1-2H3,(H2,23,29)(H,24,25,26)/t16-/m0/s1
n/an/a>1.00E+4n/an/an/an/an/an/a
Centre de Recherches
Curated by ChEMBL
Assay Description
Inhibition of ROCK2
Bioorg Med Chem Lett 16: 2672-6 (2006)
Article DOI: 10.1016/j.bmcl.2006.02.025
BindingDB Entry DOI: 10.7270/Q25H7FVK
Serine/threonine-protein kinase Chk1
(Homo sapiens (Human))
BDBM50183844
((S)-2-(((4-(3-chloro-2-fluorophenylamino)-7-methox...)
Show SMILES COc1cc2ncnc(Nc3cccc(Cl)c3F)c2cc1CN(C)[C@@H](CO)C(N)=O
Show InChI InChI=1S/C20H21ClFN5O3/c1-27(16(9-28)19(23)29)8-11-6-12-15(7-17(11)30-2)24-10-25-20(12)26-14-5-3-4-13(21)18(14)22/h3-7,10,16,28H,8-9H2,1-2H3,(H2,23,29)(H,24,25,26)/t16-/m0/s1
Reactome pathway
n/an/a>1.00E+4n/an/an/an/an/an/a
Centre de Recherches
Curated by ChEMBL
Assay Description
Inhibition of CHK1
Bioorg Med Chem Lett 16: 2672-6 (2006)
Article DOI: 10.1016/j.bmcl.2006.02.025
BindingDB Entry DOI: 10.7270/Q25H7FVK
Epidermal growth factor receptor
(Homo sapiens (Human))
BDBM50183844
((S)-2-(((4-(3-chloro-2-fluorophenylamino)-7-methox...)
Show SMILES COc1cc2ncnc(Nc3cccc(Cl)c3F)c2cc1CN(C)[C@@H](CO)C(N)=O
Show InChI InChI=1S/C20H21ClFN5O3/c1-27(16(9-28)19(23)29)8-11-6-12-15(7-17(11)30-2)24-10-25-20(12)26-14-5-3-4-13(21)18(14)22/h3-7,10,16,28H,8-9H2,1-2H3,(H2,23,29)(H,24,25,26)/t16-/m0/s1
n/an/a 20n/an/an/an/an/an/a
Centre de Recherches
Curated by ChEMBL
Assay Description
Inhibition of EGFR in presence of 2 uM ATP
Bioorg Med Chem Lett 16: 2672-6 (2006)
Article DOI: 10.1016/j.bmcl.2006.02.025
BindingDB Entry DOI: 10.7270/Q25H7FVK
Mitogen-activated protein kinase 11/12/13/14
(Homo sapiens (Human))
BDBM50183844
((S)-2-(((4-(3-chloro-2-fluorophenylamino)-7-methox...)
Show SMILES COc1cc2ncnc(Nc3cccc(Cl)c3F)c2cc1CN(C)[C@@H](CO)C(N)=O
Show InChI InChI=1S/C20H21ClFN5O3/c1-27(16(9-28)19(23)29)8-11-6-12-15(7-17(11)30-2)24-10-25-20(12)26-14-5-3-4-13(21)18(14)22/h3-7,10,16,28H,8-9H2,1-2H3,(H2,23,29)(H,24,25,26)/t16-/m0/s1
n/an/a>1.00E+4n/an/an/an/an/an/a
Centre de Recherches
Curated by ChEMBL
Assay Description
Inhibition of SAP kinase
Bioorg Med Chem Lett 16: 2672-6 (2006)
Article DOI: 10.1016/j.bmcl.2006.02.025
BindingDB Entry DOI: 10.7270/Q25H7FVK
cAMP-dependent protein kinase catalytic subunit alpha/beta/gamma
(Homo sapiens (Human))
BDBM50183844
((S)-2-(((4-(3-chloro-2-fluorophenylamino)-7-methox...)
Show SMILES COc1cc2ncnc(Nc3cccc(Cl)c3F)c2cc1CN(C)[C@@H](CO)C(N)=O
Show InChI InChI=1S/C20H21ClFN5O3/c1-27(16(9-28)19(23)29)8-11-6-12-15(7-17(11)30-2)24-10-25-20(12)26-14-5-3-4-13(21)18(14)22/h3-7,10,16,28H,8-9H2,1-2H3,(H2,23,29)(H,24,25,26)/t16-/m0/s1
n/an/a>1.00E+4n/an/an/an/an/an/a
Centre de Recherches
Curated by ChEMBL
Assay Description
Inhibition of PKA
Bioorg Med Chem Lett 16: 2672-6 (2006)
Article DOI: 10.1016/j.bmcl.2006.02.025
BindingDB Entry DOI: 10.7270/Q25H7FVK
Tyrosine-protein kinase Lck
(Homo sapiens (Human))
BDBM50183844
((S)-2-(((4-(3-chloro-2-fluorophenylamino)-7-methox...)
Show SMILES COc1cc2ncnc(Nc3cccc(Cl)c3F)c2cc1CN(C)[C@@H](CO)C(N)=O
Show InChI InChI=1S/C20H21ClFN5O3/c1-27(16(9-28)19(23)29)8-11-6-12-15(7-17(11)30-2)24-10-25-20(12)26-14-5-3-4-13(21)18(14)22/h3-7,10,16,28H,8-9H2,1-2H3,(H2,23,29)(H,24,25,26)/t16-/m0/s1
n/an/a>1.00E+4n/an/an/an/an/an/a
Centre de Recherches
Curated by ChEMBL
Assay Description
Inhibition of LCK
Bioorg Med Chem Lett 16: 2672-6 (2006)
Article DOI: 10.1016/j.bmcl.2006.02.025
BindingDB Entry DOI: 10.7270/Q25H7FVK
Glycogen synthase kinase-3 beta
(Homo sapiens (Human))
BDBM50183844
((S)-2-(((4-(3-chloro-2-fluorophenylamino)-7-methox...)
Show SMILES COc1cc2ncnc(Nc3cccc(Cl)c3F)c2cc1CN(C)[C@@H](CO)C(N)=O
Show InChI InChI=1S/C20H21ClFN5O3/c1-27(16(9-28)19(23)29)8-11-6-12-15(7-17(11)30-2)24-10-25-20(12)26-14-5-3-4-13(21)18(14)22/h3-7,10,16,28H,8-9H2,1-2H3,(H2,23,29)(H,24,25,26)/t16-/m0/s1
NCI pathway
Reactome pathway
n/an/a>1.00E+4n/an/an/an/an/an/a
Centre de Recherches
Curated by ChEMBL
Assay Description
Inhibition of GSK3-beta
Bioorg Med Chem Lett 16: 2672-6 (2006)
Article DOI: 10.1016/j.bmcl.2006.02.025
BindingDB Entry DOI: 10.7270/Q25H7FVK
Mitogen-activated protein kinase 1
(Homo sapiens (Human))
BDBM50183844
((S)-2-(((4-(3-chloro-2-fluorophenylamino)-7-methox...)
Show SMILES COc1cc2ncnc(Nc3cccc(Cl)c3F)c2cc1CN(C)[C@@H](CO)C(N)=O
Show InChI InChI=1S/C20H21ClFN5O3/c1-27(16(9-28)19(23)29)8-11-6-12-15(7-17(11)30-2)24-10-25-20(12)26-14-5-3-4-13(21)18(14)22/h3-7,10,16,28H,8-9H2,1-2H3,(H2,23,29)(H,24,25,26)/t16-/m0/s1
NCI pathway
Reactome pathway
n/an/a>1.00E+4n/an/an/an/an/an/a
Centre de Recherches
Curated by ChEMBL
Assay Description
Inhibition of MAPK
Bioorg Med Chem Lett 16: 2672-6 (2006)
Article DOI: 10.1016/j.bmcl.2006.02.025
BindingDB Entry DOI: 10.7270/Q25H7FVK
Vascular endothelial growth factor receptor 2
(Homo sapiens (Human))
BDBM50183844
((S)-2-(((4-(3-chloro-2-fluorophenylamino)-7-methox...)
Show SMILES COc1cc2ncnc(Nc3cccc(Cl)c3F)c2cc1CN(C)[C@@H](CO)C(N)=O
Show InChI InChI=1S/C20H21ClFN5O3/c1-27(16(9-28)19(23)29)8-11-6-12-15(7-17(11)30-2)24-10-25-20(12)26-14-5-3-4-13(21)18(14)22/h3-7,10,16,28H,8-9H2,1-2H3,(H2,23,29)(H,24,25,26)/t16-/m0/s1
NCI pathway
Reactome pathway
n/an/a>1.00E+4n/an/an/an/an/an/a
Centre de Recherches
Curated by ChEMBL
Assay Description
Inhibition of KDR
Bioorg Med Chem Lett 16: 2672-6 (2006)
Article DOI: 10.1016/j.bmcl.2006.02.025
BindingDB Entry DOI: 10.7270/Q25H7FVK
Serine/threonine-protein kinase Sgk1
(Homo sapiens (Human))
BDBM50183844
((S)-2-(((4-(3-chloro-2-fluorophenylamino)-7-methox...)
Show SMILES COc1cc2ncnc(Nc3cccc(Cl)c3F)c2cc1CN(C)[C@@H](CO)C(N)=O
Show InChI InChI=1S/C20H21ClFN5O3/c1-27(16(9-28)19(23)29)8-11-6-12-15(7-17(11)30-2)24-10-25-20(12)26-14-5-3-4-13(21)18(14)22/h3-7,10,16,28H,8-9H2,1-2H3,(H2,23,29)(H,24,25,26)/t16-/m0/s1
Reactome pathway
n/an/a>1.00E+4n/an/an/an/an/an/a
Centre de Recherches
Curated by ChEMBL
Assay Description
Inhibition of SGK
Bioorg Med Chem Lett 16: 2672-6 (2006)
Article DOI: 10.1016/j.bmcl.2006.02.025
BindingDB Entry DOI: 10.7270/Q25H7FVK
Proto-oncogene tyrosine-protein kinase Src
(Homo sapiens (Human))
BDBM50183844
((S)-2-(((4-(3-chloro-2-fluorophenylamino)-7-methox...)
Show SMILES COc1cc2ncnc(Nc3cccc(Cl)c3F)c2cc1CN(C)[C@@H](CO)C(N)=O
Show InChI InChI=1S/C20H21ClFN5O3/c1-27(16(9-28)19(23)29)8-11-6-12-15(7-17(11)30-2)24-10-25-20(12)26-14-5-3-4-13(21)18(14)22/h3-7,10,16,28H,8-9H2,1-2H3,(H2,23,29)(H,24,25,26)/t16-/m0/s1
n/an/a>1.00E+4n/an/an/an/an/an/a
Centre de Recherches
Curated by ChEMBL
Assay Description
Inhibition of Src
Bioorg Med Chem Lett 16: 2672-6 (2006)
Article DOI: 10.1016/j.bmcl.2006.02.025
BindingDB Entry DOI: 10.7270/Q25H7FVK
Epidermal growth factor receptor
(Homo sapiens (Human))
BDBM50183844
((S)-2-(((4-(3-chloro-2-fluorophenylamino)-7-methox...)
Show SMILES COc1cc2ncnc(Nc3cccc(Cl)c3F)c2cc1CN(C)[C@@H](CO)C(N)=O
Show InChI InChI=1S/C20H21ClFN5O3/c1-27(16(9-28)19(23)29)8-11-6-12-15(7-17(11)30-2)24-10-25-20(12)26-14-5-3-4-13(21)18(14)22/h3-7,10,16,28H,8-9H2,1-2H3,(H2,23,29)(H,24,25,26)/t16-/m0/s1
n/an/a 30n/an/an/an/an/an/a
Centre de Recherches
Curated by ChEMBL
Assay Description
Inhibition of EGFR in presence of 2 uM ATP
Bioorg Med Chem Lett 16: 2672-6 (2006)
Article DOI: 10.1016/j.bmcl.2006.02.025
BindingDB Entry DOI: 10.7270/Q25H7FVK