null
SMILES: COc1cc2ncnc(Nc3ccc(F)c(Cl)c3)c2cc1CN1CCC[C@H]1C(N)=O
InChI Key: InChIKey=VFRFZAHRSWUZQO-SFHVURJKSA-N
Activity Spreadsheet -- Enzyme Inhibition Constant Data from BindingDB
Found 13 hits for monomerid = 50183863
Trg + Lig
Ki
nM
ΔG°
kcal/mole
IC50
nM
Kd
nM
EC50/IC50
nM
koff
s-1
kon
M-1s-1
pHTemp
°C
Rho-associated protein kinase 2
(Homo sapiens (Human))
BDBM50183863
((S)-1-((4-(3-chloro-4-fluorophenylamino)-7-methoxy...)
Show SMILES COc1cc2ncnc(Nc3ccc(F)c(Cl)c3)c2cc1CN1CCC[C@H]1C(N)=O
Show InChI InChI=1S/C21H21ClFN5O2/c1-30-19-9-17-14(7-12(19)10-28-6-2-3-18(28)20(24)29)21(26-11-25-17)27-13-4-5-16(23)15(22)8-13/h4-5,7-9,11,18H,2-3,6,10H2,1H3,(H2,24,29)(H,25,26,27)/t18-/m0/s1
n/an/a>1.00E+4n/an/an/an/an/an/a
Centre de Recherches
Curated by ChEMBL
Assay Description
Inhibition of ROCK2
Bioorg Med Chem Lett 16: 2672-6 (2006)
Article DOI: 10.1016/j.bmcl.2006.02.025
BindingDB Entry DOI: 10.7270/Q25H7FVK
Serine/threonine-protein kinase Chk1
(Homo sapiens (Human))
BDBM50183863
((S)-1-((4-(3-chloro-4-fluorophenylamino)-7-methoxy...)
Show SMILES COc1cc2ncnc(Nc3ccc(F)c(Cl)c3)c2cc1CN1CCC[C@H]1C(N)=O
Show InChI InChI=1S/C21H21ClFN5O2/c1-30-19-9-17-14(7-12(19)10-28-6-2-3-18(28)20(24)29)21(26-11-25-17)27-13-4-5-16(23)15(22)8-13/h4-5,7-9,11,18H,2-3,6,10H2,1H3,(H2,24,29)(H,25,26,27)/t18-/m0/s1
Reactome pathway
n/an/a>1.00E+4n/an/an/an/an/an/a
Centre de Recherches
Curated by ChEMBL
Assay Description
Inhibition of CHK1
Bioorg Med Chem Lett 16: 2672-6 (2006)
Article DOI: 10.1016/j.bmcl.2006.02.025
BindingDB Entry DOI: 10.7270/Q25H7FVK
Mitogen-activated protein kinase 10/8/9
(Homo sapiens (Human))
BDBM50183863
((S)-1-((4-(3-chloro-4-fluorophenylamino)-7-methoxy...)
Show SMILES COc1cc2ncnc(Nc3ccc(F)c(Cl)c3)c2cc1CN1CCC[C@H]1C(N)=O
Show InChI InChI=1S/C21H21ClFN5O2/c1-30-19-9-17-14(7-12(19)10-28-6-2-3-18(28)20(24)29)21(26-11-25-17)27-13-4-5-16(23)15(22)8-13/h4-5,7-9,11,18H,2-3,6,10H2,1H3,(H2,24,29)(H,25,26,27)/t18-/m0/s1
NCI pathway
Reactome pathway
n/an/a>1.00E+4n/an/an/an/an/an/a
Centre de Recherches
Curated by ChEMBL
Assay Description
Inhibition of JNK
Bioorg Med Chem Lett 16: 2672-6 (2006)
Article DOI: 10.1016/j.bmcl.2006.02.025
BindingDB Entry DOI: 10.7270/Q25H7FVK
cAMP-dependent protein kinase catalytic subunit alpha/beta/gamma
(Homo sapiens (Human))
BDBM50183863
((S)-1-((4-(3-chloro-4-fluorophenylamino)-7-methoxy...)
Show SMILES COc1cc2ncnc(Nc3ccc(F)c(Cl)c3)c2cc1CN1CCC[C@H]1C(N)=O
Show InChI InChI=1S/C21H21ClFN5O2/c1-30-19-9-17-14(7-12(19)10-28-6-2-3-18(28)20(24)29)21(26-11-25-17)27-13-4-5-16(23)15(22)8-13/h4-5,7-9,11,18H,2-3,6,10H2,1H3,(H2,24,29)(H,25,26,27)/t18-/m0/s1
n/an/a>1.00E+4n/an/an/an/an/an/a
Centre de Recherches
Curated by ChEMBL
Assay Description
Inhibition of PKA
Bioorg Med Chem Lett 16: 2672-6 (2006)
Article DOI: 10.1016/j.bmcl.2006.02.025
BindingDB Entry DOI: 10.7270/Q25H7FVK
Epidermal growth factor receptor
(Homo sapiens (Human))
BDBM50183863
((S)-1-((4-(3-chloro-4-fluorophenylamino)-7-methoxy...)
Show SMILES COc1cc2ncnc(Nc3ccc(F)c(Cl)c3)c2cc1CN1CCC[C@H]1C(N)=O
Show InChI InChI=1S/C21H21ClFN5O2/c1-30-19-9-17-14(7-12(19)10-28-6-2-3-18(28)20(24)29)21(26-11-25-17)27-13-4-5-16(23)15(22)8-13/h4-5,7-9,11,18H,2-3,6,10H2,1H3,(H2,24,29)(H,25,26,27)/t18-/m0/s1
n/an/a 20n/an/an/an/an/an/a
Centre de Recherches
Curated by ChEMBL
Assay Description
Inhibition of EGFR in presence of 2 uM ATP
Bioorg Med Chem Lett 16: 2672-6 (2006)
Article DOI: 10.1016/j.bmcl.2006.02.025
BindingDB Entry DOI: 10.7270/Q25H7FVK
Mitogen-activated protein kinase 11/12/13/14
(Homo sapiens (Human))
BDBM50183863
((S)-1-((4-(3-chloro-4-fluorophenylamino)-7-methoxy...)
Show SMILES COc1cc2ncnc(Nc3ccc(F)c(Cl)c3)c2cc1CN1CCC[C@H]1C(N)=O
Show InChI InChI=1S/C21H21ClFN5O2/c1-30-19-9-17-14(7-12(19)10-28-6-2-3-18(28)20(24)29)21(26-11-25-17)27-13-4-5-16(23)15(22)8-13/h4-5,7-9,11,18H,2-3,6,10H2,1H3,(H2,24,29)(H,25,26,27)/t18-/m0/s1
n/an/a>1.00E+4n/an/an/an/an/an/a
Centre de Recherches
Curated by ChEMBL
Assay Description
Inhibition of SAP kinase
Bioorg Med Chem Lett 16: 2672-6 (2006)
Article DOI: 10.1016/j.bmcl.2006.02.025
BindingDB Entry DOI: 10.7270/Q25H7FVK
Vascular endothelial growth factor receptor 2
(Homo sapiens (Human))
BDBM50183863
((S)-1-((4-(3-chloro-4-fluorophenylamino)-7-methoxy...)
Show SMILES COc1cc2ncnc(Nc3ccc(F)c(Cl)c3)c2cc1CN1CCC[C@H]1C(N)=O
Show InChI InChI=1S/C21H21ClFN5O2/c1-30-19-9-17-14(7-12(19)10-28-6-2-3-18(28)20(24)29)21(26-11-25-17)27-13-4-5-16(23)15(22)8-13/h4-5,7-9,11,18H,2-3,6,10H2,1H3,(H2,24,29)(H,25,26,27)/t18-/m0/s1
NCI pathway
Reactome pathway
n/an/a>1.00E+4n/an/an/an/an/an/a
Centre de Recherches
Curated by ChEMBL
Assay Description
Inhibition of KDR
Bioorg Med Chem Lett 16: 2672-6 (2006)
Article DOI: 10.1016/j.bmcl.2006.02.025
BindingDB Entry DOI: 10.7270/Q25H7FVK
Serine/threonine-protein kinase Sgk1
(Homo sapiens (Human))
BDBM50183863
((S)-1-((4-(3-chloro-4-fluorophenylamino)-7-methoxy...)
Show SMILES COc1cc2ncnc(Nc3ccc(F)c(Cl)c3)c2cc1CN1CCC[C@H]1C(N)=O
Show InChI InChI=1S/C21H21ClFN5O2/c1-30-19-9-17-14(7-12(19)10-28-6-2-3-18(28)20(24)29)21(26-11-25-17)27-13-4-5-16(23)15(22)8-13/h4-5,7-9,11,18H,2-3,6,10H2,1H3,(H2,24,29)(H,25,26,27)/t18-/m0/s1
Reactome pathway
n/an/a>1.00E+4n/an/an/an/an/an/a
Centre de Recherches
Curated by ChEMBL
Assay Description
Inhibition of SGK
Bioorg Med Chem Lett 16: 2672-6 (2006)
Article DOI: 10.1016/j.bmcl.2006.02.025
BindingDB Entry DOI: 10.7270/Q25H7FVK
Glycogen synthase kinase-3 beta
(Homo sapiens (Human))
BDBM50183863
((S)-1-((4-(3-chloro-4-fluorophenylamino)-7-methoxy...)
Show SMILES COc1cc2ncnc(Nc3ccc(F)c(Cl)c3)c2cc1CN1CCC[C@H]1C(N)=O
Show InChI InChI=1S/C21H21ClFN5O2/c1-30-19-9-17-14(7-12(19)10-28-6-2-3-18(28)20(24)29)21(26-11-25-17)27-13-4-5-16(23)15(22)8-13/h4-5,7-9,11,18H,2-3,6,10H2,1H3,(H2,24,29)(H,25,26,27)/t18-/m0/s1
NCI pathway
Reactome pathway
n/an/a>1.00E+4n/an/an/an/an/an/a
Centre de Recherches
Curated by ChEMBL
Assay Description
Inhibition of GSK3-beta
Bioorg Med Chem Lett 16: 2672-6 (2006)
Article DOI: 10.1016/j.bmcl.2006.02.025
BindingDB Entry DOI: 10.7270/Q25H7FVK
Epidermal growth factor receptor
(Homo sapiens (Human))
BDBM50183863
((S)-1-((4-(3-chloro-4-fluorophenylamino)-7-methoxy...)
Show SMILES COc1cc2ncnc(Nc3ccc(F)c(Cl)c3)c2cc1CN1CCC[C@H]1C(N)=O
Show InChI InChI=1S/C21H21ClFN5O2/c1-30-19-9-17-14(7-12(19)10-28-6-2-3-18(28)20(24)29)21(26-11-25-17)27-13-4-5-16(23)15(22)8-13/h4-5,7-9,11,18H,2-3,6,10H2,1H3,(H2,24,29)(H,25,26,27)/t18-/m0/s1
n/an/a 90n/an/an/an/an/an/a
Centre de Recherches
Curated by ChEMBL
Assay Description
Inhibition of EGFR in presence of 2 uM ATP
Bioorg Med Chem Lett 16: 2672-6 (2006)
Article DOI: 10.1016/j.bmcl.2006.02.025
BindingDB Entry DOI: 10.7270/Q25H7FVK
Proto-oncogene tyrosine-protein kinase Src
(Homo sapiens (Human))
BDBM50183863
((S)-1-((4-(3-chloro-4-fluorophenylamino)-7-methoxy...)
Show SMILES COc1cc2ncnc(Nc3ccc(F)c(Cl)c3)c2cc1CN1CCC[C@H]1C(N)=O
Show InChI InChI=1S/C21H21ClFN5O2/c1-30-19-9-17-14(7-12(19)10-28-6-2-3-18(28)20(24)29)21(26-11-25-17)27-13-4-5-16(23)15(22)8-13/h4-5,7-9,11,18H,2-3,6,10H2,1H3,(H2,24,29)(H,25,26,27)/t18-/m0/s1
n/an/a>1.00E+4n/an/an/an/an/an/a
Centre de Recherches
Curated by ChEMBL
Assay Description
Inhibition of Src
Bioorg Med Chem Lett 16: 2672-6 (2006)
Article DOI: 10.1016/j.bmcl.2006.02.025
BindingDB Entry DOI: 10.7270/Q25H7FVK
Mitogen-activated protein kinase 1
(Homo sapiens (Human))
BDBM50183863
((S)-1-((4-(3-chloro-4-fluorophenylamino)-7-methoxy...)
Show SMILES COc1cc2ncnc(Nc3ccc(F)c(Cl)c3)c2cc1CN1CCC[C@H]1C(N)=O
Show InChI InChI=1S/C21H21ClFN5O2/c1-30-19-9-17-14(7-12(19)10-28-6-2-3-18(28)20(24)29)21(26-11-25-17)27-13-4-5-16(23)15(22)8-13/h4-5,7-9,11,18H,2-3,6,10H2,1H3,(H2,24,29)(H,25,26,27)/t18-/m0/s1
NCI pathway
Reactome pathway
n/an/a>1.00E+4n/an/an/an/an/an/a
Centre de Recherches
Curated by ChEMBL
Assay Description
Inhibition of MAPK
Bioorg Med Chem Lett 16: 2672-6 (2006)
Article DOI: 10.1016/j.bmcl.2006.02.025
BindingDB Entry DOI: 10.7270/Q25H7FVK
Tyrosine-protein kinase Lck
(Homo sapiens (Human))
BDBM50183863
((S)-1-((4-(3-chloro-4-fluorophenylamino)-7-methoxy...)
Show SMILES COc1cc2ncnc(Nc3ccc(F)c(Cl)c3)c2cc1CN1CCC[C@H]1C(N)=O
Show InChI InChI=1S/C21H21ClFN5O2/c1-30-19-9-17-14(7-12(19)10-28-6-2-3-18(28)20(24)29)21(26-11-25-17)27-13-4-5-16(23)15(22)8-13/h4-5,7-9,11,18H,2-3,6,10H2,1H3,(H2,24,29)(H,25,26,27)/t18-/m0/s1
n/an/a>1.00E+4n/an/an/an/an/an/a
Centre de Recherches
Curated by ChEMBL
Assay Description
Inhibition of LCK
Bioorg Med Chem Lett 16: 2672-6 (2006)
Article DOI: 10.1016/j.bmcl.2006.02.025
BindingDB Entry DOI: 10.7270/Q25H7FVK