BDBM50183966 4-(8-(benzo[d][1,3]dioxol-5-ylmethyl)-8-aza-bicyclo[3.2.1]octan-3-ylamino)-6-chloro-1-(2,2,2-trifluoroethyl)quinazolin-2(1H)-one::CHEMBL205493
SMILES: FC(F)(F)Cn1c2ccc(Cl)cc2c(NC2CC3CCC(C2)N3Cc2ccc3OCOc3c2)nc1=O
InChI Key: InChIKey=TUISOQBOQRFWFJ-UHFFFAOYSA-N
Data: 1 KI  2 IC50
Activity Spreadsheet -- Enzyme Inhibition Constant Data from BindingDB
Found 3 hits for monomerid = 50183966
Trg + Lig
Ki
nM
ΔG°
kcal/mole
IC50
nM
Kd
nM
EC50/IC50
nM
koff
s-1
kon
M-1s-1
pHTemp
°C
Potassium voltage-gated channel subfamily H member 2
(Homo sapiens (Human))
BDBM50183966
(4-(8-(benzo[d][1,3]dioxol-5-ylmethyl)-8-aza-bicycl...)
Show SMILES FC(F)(F)Cn1c2ccc(Cl)cc2c(NC2CC3CCC(C2)N3Cc2ccc3OCOc3c2)nc1=O |TLB:14:15:22:18.19|
Show InChI InChI=1S/C25H24ClF3N4O3/c26-15-2-5-20-19(8-15)23(31-24(34)33(20)12-25(27,28)29)30-16-9-17-3-4-18(10-16)32(17)11-14-1-6-21-22(7-14)36-13-35-21/h1-2,5-8,16-18H,3-4,9-13H2,(H,30,31,34)
Reactome pathway
120n/an/an/an/an/an/an/an/a
Millennium Pharmaceuticals, Inc.
Curated by ChEMBL
Assay Description
Binding affinity to hERG stably transfected in HEK293 cells
Bioorg Med Chem Lett 16: 2621-7 (2006)
Article DOI: 10.1016/j.bmcl.2006.02.044
BindingDB Entry DOI: 10.7270/Q2SB45CQ
Melanin-concentrating hormone receptor 1
(Homo sapiens (Human))
BDBM50183966
(4-(8-(benzo[d][1,3]dioxol-5-ylmethyl)-8-aza-bicycl...)
Show SMILES FC(F)(F)Cn1c2ccc(Cl)cc2c(NC2CC3CCC(C2)N3Cc2ccc3OCOc3c2)nc1=O |TLB:14:15:22:18.19|
Show InChI InChI=1S/C25H24ClF3N4O3/c26-15-2-5-20-19(8-15)23(31-24(34)33(20)12-25(27,28)29)30-16-9-17-3-4-18(10-16)32(17)11-14-1-6-21-22(7-14)36-13-35-21/h1-2,5-8,16-18H,3-4,9-13H2,(H,30,31,34)
Reactome pathway
n/an/a 4n/an/an/an/an/an/a
Millennium Pharmaceuticals, Inc.
Curated by ChEMBL
Assay Description
Displacement of [125I]MCH from MCHr1 expressed in IMR32 cells
Bioorg Med Chem Lett 16: 2621-7 (2006)
Article DOI: 10.1016/j.bmcl.2006.02.044
BindingDB Entry DOI: 10.7270/Q2SB45CQ
Melanin-concentrating hormone receptor 1
(Homo sapiens (Human))
BDBM50183966
(4-(8-(benzo[d][1,3]dioxol-5-ylmethyl)-8-aza-bicycl...)
Show SMILES FC(F)(F)Cn1c2ccc(Cl)cc2c(NC2CC3CCC(C2)N3Cc2ccc3OCOc3c2)nc1=O |TLB:14:15:22:18.19|
Show InChI InChI=1S/C25H24ClF3N4O3/c26-15-2-5-20-19(8-15)23(31-24(34)33(20)12-25(27,28)29)30-16-9-17-3-4-18(10-16)32(17)11-14-1-6-21-22(7-14)36-13-35-21/h1-2,5-8,16-18H,3-4,9-13H2,(H,30,31,34)
Reactome pathway
n/an/a 31n/an/an/an/an/an/a
Millennium Pharmaceuticals, Inc.
Curated by ChEMBL
Assay Description
Inhibition of MCH-mediated calcium release in whole IMR32 cells by FLIPR
Bioorg Med Chem Lett 16: 2621-7 (2006)
Article DOI: 10.1016/j.bmcl.2006.02.044
BindingDB Entry DOI: 10.7270/Q2SB45CQ