null
SMILES: COc1cc(Nc2ncc3ccn(-c4ccccc4C(=O)NCCCN(C)C)c3n2)cc(OC)c1OC
InChI Key: InChIKey=JNZYOMISLHATLT-UHFFFAOYSA-N
Activity Spreadsheet -- Enzyme Inhibition Constant Data from BindingDB
Found 1 hit for monomerid = 50183999
Trg + Lig
Ki
nM
ΔG°
kcal/mole
IC50
nM
Kd
nM
EC50/IC50
nM
koff
s-1
kon
M-1s-1
pHTemp
°C
Focal adhesion kinase 1
(Homo sapiens (Human))
BDBM50183999
(CHEMBL207904 | N-(3-(dimethylamino)propyl)-2-(2-(3...)
Show SMILES COc1cc(Nc2ncc3ccn(-c4ccccc4C(=O)NCCCN(C)C)c3n2)cc(OC)c1OC
Show InChI InChI=1S/C27H32N6O4/c1-32(2)13-8-12-28-26(34)20-9-6-7-10-21(20)33-14-11-18-17-29-27(31-25(18)33)30-19-15-22(35-3)24(37-5)23(16-19)36-4/h6-7,9-11,14-17H,8,12-13H2,1-5H3,(H,28,34)(H,29,30,31)
NCI pathway
Reactome pathway
n/an/a>1.00E+4n/an/an/an/an/an/a
Genomics Institute of the Novartis Research Foundation (GNF)
Curated by ChEMBL
Assay Description
Inhibition of FAK
Bioorg Med Chem Lett 16: 2689-92 (2006)
Article DOI: 10.1016/j.bmcl.2006.02.032
BindingDB Entry DOI: 10.7270/Q2NK3DN0