BDBM50184366 CHEMBL203760::c[Nle-Pro-D-Nal(2')-Arg-Trp-Glu]-NH2
SMILES: CCCC[C@@H]1NC(=O)CC[C@H](NC(=O)[C@H](Cc2c[nH]c3ccccc23)NC(=O)[C@H](CCCN=C(N)N)NC(=O)[C@@H](Cc2ccc3ccccc3c2)NC(=O)[C@@H]2CCCN2C1=O)C(N)=O
InChI Key: InChIKey=QQCJWXXVYXUARZ-ZPRVLUMXSA-N
Data: 4 IC50  4 EC50
Activity Spreadsheet -- Enzyme Inhibition Constant Data from BindingDB
Found 8 hits for monomerid = 50184366
Trg + Lig
Ki
nM
ΔG°
kcal/mole
IC50
nM
Kd
nM
EC50/IC50
nM
koff
s-1
kon
M-1s-1
pHTemp
°C
Melanocortin receptor 3
(Homo sapiens (Human))
BDBM50184366
(CHEMBL203760 | c[Nle-Pro-D-Nal(2')-Arg-Trp-Glu]-NH...)
Show SMILES CCCC[C@@H]1NC(=O)CC[C@H](NC(=O)[C@H](Cc2c[nH]c3ccccc23)NC(=O)[C@H](CCCN=C(N)N)NC(=O)[C@@H](Cc2ccc3ccccc3c2)NC(=O)[C@@H]2CCCN2C1=O)C(N)=O |wU:10.66,39.41,wD:28.30,54.62,14.14,4.3,(-2.1,4.1,;-2.1,2.56,;-1.01,1.84,;-1.02,.32,;.21,-.38,;1.91,.24,;1.91,1.78,;.57,2.54,;3.12,2.56,;3.64,3.84,;5.16,4.05,;5.93,2.72,;6.69,1.39,;8.17,1.8,;7.09,-.09,;8.63,-.09,;9.4,-1.43,;9.39,-2.97,;10.85,-3.46,;11.76,-2.22,;13.28,-2.07,;13.92,-.67,;13.02,.59,;11.49,.43,;10.86,-.96,;6.15,-1.31,;6.74,-2.74,;8.28,-2.73,;6.33,-4.22,;7.42,-5.3,;8.91,-4.91,;10,-5.99,;11.48,-5.6,;12.57,-6.69,;14.06,-6.29,;12.17,-8.17,;4.99,-4.98,;3.66,-4.2,;3.67,-2.66,;2.33,-4.96,;2.32,-6.5,;3.65,-7.28,;4.98,-6.51,;6.31,-7.27,;6.31,-8.82,;7.64,-9.59,;7.64,-11.12,;6.3,-11.9,;4.97,-11.12,;4.98,-9.58,;3.65,-8.81,;.99,-4.19,;-.34,-4.96,;-.37,-6.5,;-1.87,-4,;-3.41,-4.17,;-4.04,-2.76,;-2.89,-1.72,;-1.56,-2.49,;-.13,-1.9,;1.09,-2.65,;5.94,5.38,;5.17,6.72,;7.48,5.38,)|
Show InChI InChI=1S/C46H59N11O7/c1-2-3-13-35-45(64)57-22-9-16-38(57)44(63)56-36(24-27-17-18-28-10-4-5-11-29(28)23-27)42(61)54-34(15-8-21-50-46(48)49)41(60)55-37(25-30-26-51-32-14-7-6-12-31(30)32)43(62)53-33(40(47)59)19-20-39(58)52-35/h4-7,10-12,14,17-18,23,26,33-38,51H,2-3,8-9,13,15-16,19-22,24-25H2,1H3,(H2,47,59)(H,52,58)(H,53,62)(H,54,61)(H,55,60)(H,56,63)(H4,48,49,50)/t33-,34-,35-,36+,37-,38-/m0/s1
n/an/an/an/a>1.00E+4n/an/an/an/a
University of Arizona
Curated by ChEMBL
Assay Description
Activity against hMC3R transfected in HEK293 cells by intracellular cAMP accumulation
J Med Chem 49: 1946-52 (2006)
Article DOI: 10.1021/jm0510326
BindingDB Entry DOI: 10.7270/Q2C24W1F
Melanocortin receptor 5 (MC5R)
(Homo sapiens (Human))
BDBM50184366
(CHEMBL203760 | c[Nle-Pro-D-Nal(2')-Arg-Trp-Glu]-NH...)
Show SMILES CCCC[C@@H]1NC(=O)CC[C@H](NC(=O)[C@H](Cc2c[nH]c3ccccc23)NC(=O)[C@H](CCCN=C(N)N)NC(=O)[C@@H](Cc2ccc3ccccc3c2)NC(=O)[C@@H]2CCCN2C1=O)C(N)=O |wU:10.66,39.41,wD:28.30,54.62,14.14,4.3,(-2.1,4.1,;-2.1,2.56,;-1.01,1.84,;-1.02,.32,;.21,-.38,;1.91,.24,;1.91,1.78,;.57,2.54,;3.12,2.56,;3.64,3.84,;5.16,4.05,;5.93,2.72,;6.69,1.39,;8.17,1.8,;7.09,-.09,;8.63,-.09,;9.4,-1.43,;9.39,-2.97,;10.85,-3.46,;11.76,-2.22,;13.28,-2.07,;13.92,-.67,;13.02,.59,;11.49,.43,;10.86,-.96,;6.15,-1.31,;6.74,-2.74,;8.28,-2.73,;6.33,-4.22,;7.42,-5.3,;8.91,-4.91,;10,-5.99,;11.48,-5.6,;12.57,-6.69,;14.06,-6.29,;12.17,-8.17,;4.99,-4.98,;3.66,-4.2,;3.67,-2.66,;2.33,-4.96,;2.32,-6.5,;3.65,-7.28,;4.98,-6.51,;6.31,-7.27,;6.31,-8.82,;7.64,-9.59,;7.64,-11.12,;6.3,-11.9,;4.97,-11.12,;4.98,-9.58,;3.65,-8.81,;.99,-4.19,;-.34,-4.96,;-.37,-6.5,;-1.87,-4,;-3.41,-4.17,;-4.04,-2.76,;-2.89,-1.72,;-1.56,-2.49,;-.13,-1.9,;1.09,-2.65,;5.94,5.38,;5.17,6.72,;7.48,5.38,)|
Show InChI InChI=1S/C46H59N11O7/c1-2-3-13-35-45(64)57-22-9-16-38(57)44(63)56-36(24-27-17-18-28-10-4-5-11-29(28)23-27)42(61)54-34(15-8-21-50-46(48)49)41(60)55-37(25-30-26-51-32-14-7-6-12-31(30)32)43(62)53-33(40(47)59)19-20-39(58)52-35/h4-7,10-12,14,17-18,23,26,33-38,51H,2-3,8-9,13,15-16,19-22,24-25H2,1H3,(H2,47,59)(H,52,58)(H,53,62)(H,54,61)(H,55,60)(H,56,63)(H4,48,49,50)/t33-,34-,35-,36+,37-,38-/m0/s1
n/an/a 10n/an/an/an/an/an/a
University of Arizona
Curated by ChEMBL
Assay Description
Inhibitory activity against hMC5R transfected in HEK293 cells
J Med Chem 49: 1946-52 (2006)
Article DOI: 10.1021/jm0510326
BindingDB Entry DOI: 10.7270/Q2C24W1F
Melanocortin receptor 4
(Homo sapiens (Human))
BDBM50184366
(CHEMBL203760 | c[Nle-Pro-D-Nal(2')-Arg-Trp-Glu]-NH...)
Show SMILES CCCC[C@@H]1NC(=O)CC[C@H](NC(=O)[C@H](Cc2c[nH]c3ccccc23)NC(=O)[C@H](CCCN=C(N)N)NC(=O)[C@@H](Cc2ccc3ccccc3c2)NC(=O)[C@@H]2CCCN2C1=O)C(N)=O |wU:10.66,39.41,wD:28.30,54.62,14.14,4.3,(-2.1,4.1,;-2.1,2.56,;-1.01,1.84,;-1.02,.32,;.21,-.38,;1.91,.24,;1.91,1.78,;.57,2.54,;3.12,2.56,;3.64,3.84,;5.16,4.05,;5.93,2.72,;6.69,1.39,;8.17,1.8,;7.09,-.09,;8.63,-.09,;9.4,-1.43,;9.39,-2.97,;10.85,-3.46,;11.76,-2.22,;13.28,-2.07,;13.92,-.67,;13.02,.59,;11.49,.43,;10.86,-.96,;6.15,-1.31,;6.74,-2.74,;8.28,-2.73,;6.33,-4.22,;7.42,-5.3,;8.91,-4.91,;10,-5.99,;11.48,-5.6,;12.57,-6.69,;14.06,-6.29,;12.17,-8.17,;4.99,-4.98,;3.66,-4.2,;3.67,-2.66,;2.33,-4.96,;2.32,-6.5,;3.65,-7.28,;4.98,-6.51,;6.31,-7.27,;6.31,-8.82,;7.64,-9.59,;7.64,-11.12,;6.3,-11.9,;4.97,-11.12,;4.98,-9.58,;3.65,-8.81,;.99,-4.19,;-.34,-4.96,;-.37,-6.5,;-1.87,-4,;-3.41,-4.17,;-4.04,-2.76,;-2.89,-1.72,;-1.56,-2.49,;-.13,-1.9,;1.09,-2.65,;5.94,5.38,;5.17,6.72,;7.48,5.38,)|
Show InChI InChI=1S/C46H59N11O7/c1-2-3-13-35-45(64)57-22-9-16-38(57)44(63)56-36(24-27-17-18-28-10-4-5-11-29(28)23-27)42(61)54-34(15-8-21-50-46(48)49)41(60)55-37(25-30-26-51-32-14-7-6-12-31(30)32)43(62)53-33(40(47)59)19-20-39(58)52-35/h4-7,10-12,14,17-18,23,26,33-38,51H,2-3,8-9,13,15-16,19-22,24-25H2,1H3,(H2,47,59)(H,52,58)(H,53,62)(H,54,61)(H,55,60)(H,56,63)(H4,48,49,50)/t33-,34-,35-,36+,37-,38-/m0/s1
n/an/a 1.00E+3n/an/an/an/an/an/a
University of Arizona
Curated by ChEMBL
Assay Description
Inhibitory activity against hMC4R transfected in HEK293 cells
J Med Chem 49: 1946-52 (2006)
Article DOI: 10.1021/jm0510326
BindingDB Entry DOI: 10.7270/Q2C24W1F
Melanocyte-stimulating hormone receptor
(Homo sapiens (Human))
BDBM50184366
(CHEMBL203760 | c[Nle-Pro-D-Nal(2')-Arg-Trp-Glu]-NH...)
Show SMILES CCCC[C@@H]1NC(=O)CC[C@H](NC(=O)[C@H](Cc2c[nH]c3ccccc23)NC(=O)[C@H](CCCN=C(N)N)NC(=O)[C@@H](Cc2ccc3ccccc3c2)NC(=O)[C@@H]2CCCN2C1=O)C(N)=O |wU:10.66,39.41,wD:28.30,54.62,14.14,4.3,(-2.1,4.1,;-2.1,2.56,;-1.01,1.84,;-1.02,.32,;.21,-.38,;1.91,.24,;1.91,1.78,;.57,2.54,;3.12,2.56,;3.64,3.84,;5.16,4.05,;5.93,2.72,;6.69,1.39,;8.17,1.8,;7.09,-.09,;8.63,-.09,;9.4,-1.43,;9.39,-2.97,;10.85,-3.46,;11.76,-2.22,;13.28,-2.07,;13.92,-.67,;13.02,.59,;11.49,.43,;10.86,-.96,;6.15,-1.31,;6.74,-2.74,;8.28,-2.73,;6.33,-4.22,;7.42,-5.3,;8.91,-4.91,;10,-5.99,;11.48,-5.6,;12.57,-6.69,;14.06,-6.29,;12.17,-8.17,;4.99,-4.98,;3.66,-4.2,;3.67,-2.66,;2.33,-4.96,;2.32,-6.5,;3.65,-7.28,;4.98,-6.51,;6.31,-7.27,;6.31,-8.82,;7.64,-9.59,;7.64,-11.12,;6.3,-11.9,;4.97,-11.12,;4.98,-9.58,;3.65,-8.81,;.99,-4.19,;-.34,-4.96,;-.37,-6.5,;-1.87,-4,;-3.41,-4.17,;-4.04,-2.76,;-2.89,-1.72,;-1.56,-2.49,;-.13,-1.9,;1.09,-2.65,;5.94,5.38,;5.17,6.72,;7.48,5.38,)|
Show InChI InChI=1S/C46H59N11O7/c1-2-3-13-35-45(64)57-22-9-16-38(57)44(63)56-36(24-27-17-18-28-10-4-5-11-29(28)23-27)42(61)54-34(15-8-21-50-46(48)49)41(60)55-37(25-30-26-51-32-14-7-6-12-31(30)32)43(62)53-33(40(47)59)19-20-39(58)52-35/h4-7,10-12,14,17-18,23,26,33-38,51H,2-3,8-9,13,15-16,19-22,24-25H2,1H3,(H2,47,59)(H,52,58)(H,53,62)(H,54,61)(H,55,60)(H,56,63)(H4,48,49,50)/t33-,34-,35-,36+,37-,38-/m0/s1
n/an/an/an/a>1.00E+4n/an/an/an/a
University of Arizona
Curated by ChEMBL
Assay Description
Activity against hMC1R transfected in HEK293 cells by intracellular cAMP accumulation
J Med Chem 49: 1946-52 (2006)
Article DOI: 10.1021/jm0510326
BindingDB Entry DOI: 10.7270/Q2C24W1F
Melanocortin receptor 3
(Homo sapiens (Human))
BDBM50184366
(CHEMBL203760 | c[Nle-Pro-D-Nal(2')-Arg-Trp-Glu]-NH...)
Show SMILES CCCC[C@@H]1NC(=O)CC[C@H](NC(=O)[C@H](Cc2c[nH]c3ccccc23)NC(=O)[C@H](CCCN=C(N)N)NC(=O)[C@@H](Cc2ccc3ccccc3c2)NC(=O)[C@@H]2CCCN2C1=O)C(N)=O |wU:10.66,39.41,wD:28.30,54.62,14.14,4.3,(-2.1,4.1,;-2.1,2.56,;-1.01,1.84,;-1.02,.32,;.21,-.38,;1.91,.24,;1.91,1.78,;.57,2.54,;3.12,2.56,;3.64,3.84,;5.16,4.05,;5.93,2.72,;6.69,1.39,;8.17,1.8,;7.09,-.09,;8.63,-.09,;9.4,-1.43,;9.39,-2.97,;10.85,-3.46,;11.76,-2.22,;13.28,-2.07,;13.92,-.67,;13.02,.59,;11.49,.43,;10.86,-.96,;6.15,-1.31,;6.74,-2.74,;8.28,-2.73,;6.33,-4.22,;7.42,-5.3,;8.91,-4.91,;10,-5.99,;11.48,-5.6,;12.57,-6.69,;14.06,-6.29,;12.17,-8.17,;4.99,-4.98,;3.66,-4.2,;3.67,-2.66,;2.33,-4.96,;2.32,-6.5,;3.65,-7.28,;4.98,-6.51,;6.31,-7.27,;6.31,-8.82,;7.64,-9.59,;7.64,-11.12,;6.3,-11.9,;4.97,-11.12,;4.98,-9.58,;3.65,-8.81,;.99,-4.19,;-.34,-4.96,;-.37,-6.5,;-1.87,-4,;-3.41,-4.17,;-4.04,-2.76,;-2.89,-1.72,;-1.56,-2.49,;-.13,-1.9,;1.09,-2.65,;5.94,5.38,;5.17,6.72,;7.48,5.38,)|
Show InChI InChI=1S/C46H59N11O7/c1-2-3-13-35-45(64)57-22-9-16-38(57)44(63)56-36(24-27-17-18-28-10-4-5-11-29(28)23-27)42(61)54-34(15-8-21-50-46(48)49)41(60)55-37(25-30-26-51-32-14-7-6-12-31(30)32)43(62)53-33(40(47)59)19-20-39(58)52-35/h4-7,10-12,14,17-18,23,26,33-38,51H,2-3,8-9,13,15-16,19-22,24-25H2,1H3,(H2,47,59)(H,52,58)(H,53,62)(H,54,61)(H,55,60)(H,56,63)(H4,48,49,50)/t33-,34-,35-,36+,37-,38-/m0/s1
n/an/a 13n/an/an/an/an/an/a
University of Arizona
Curated by ChEMBL
Assay Description
Inhibitory activity against hMC3R transfected in HEK293 cells
J Med Chem 49: 1946-52 (2006)
Article DOI: 10.1021/jm0510326
BindingDB Entry DOI: 10.7270/Q2C24W1F
Melanocortin receptor 4
(Homo sapiens (Human))
BDBM50184366
(CHEMBL203760 | c[Nle-Pro-D-Nal(2')-Arg-Trp-Glu]-NH...)
Show SMILES CCCC[C@@H]1NC(=O)CC[C@H](NC(=O)[C@H](Cc2c[nH]c3ccccc23)NC(=O)[C@H](CCCN=C(N)N)NC(=O)[C@@H](Cc2ccc3ccccc3c2)NC(=O)[C@@H]2CCCN2C1=O)C(N)=O |wU:10.66,39.41,wD:28.30,54.62,14.14,4.3,(-2.1,4.1,;-2.1,2.56,;-1.01,1.84,;-1.02,.32,;.21,-.38,;1.91,.24,;1.91,1.78,;.57,2.54,;3.12,2.56,;3.64,3.84,;5.16,4.05,;5.93,2.72,;6.69,1.39,;8.17,1.8,;7.09,-.09,;8.63,-.09,;9.4,-1.43,;9.39,-2.97,;10.85,-3.46,;11.76,-2.22,;13.28,-2.07,;13.92,-.67,;13.02,.59,;11.49,.43,;10.86,-.96,;6.15,-1.31,;6.74,-2.74,;8.28,-2.73,;6.33,-4.22,;7.42,-5.3,;8.91,-4.91,;10,-5.99,;11.48,-5.6,;12.57,-6.69,;14.06,-6.29,;12.17,-8.17,;4.99,-4.98,;3.66,-4.2,;3.67,-2.66,;2.33,-4.96,;2.32,-6.5,;3.65,-7.28,;4.98,-6.51,;6.31,-7.27,;6.31,-8.82,;7.64,-9.59,;7.64,-11.12,;6.3,-11.9,;4.97,-11.12,;4.98,-9.58,;3.65,-8.81,;.99,-4.19,;-.34,-4.96,;-.37,-6.5,;-1.87,-4,;-3.41,-4.17,;-4.04,-2.76,;-2.89,-1.72,;-1.56,-2.49,;-.13,-1.9,;1.09,-2.65,;5.94,5.38,;5.17,6.72,;7.48,5.38,)|
Show InChI InChI=1S/C46H59N11O7/c1-2-3-13-35-45(64)57-22-9-16-38(57)44(63)56-36(24-27-17-18-28-10-4-5-11-29(28)23-27)42(61)54-34(15-8-21-50-46(48)49)41(60)55-37(25-30-26-51-32-14-7-6-12-31(30)32)43(62)53-33(40(47)59)19-20-39(58)52-35/h4-7,10-12,14,17-18,23,26,33-38,51H,2-3,8-9,13,15-16,19-22,24-25H2,1H3,(H2,47,59)(H,52,58)(H,53,62)(H,54,61)(H,55,60)(H,56,63)(H4,48,49,50)/t33-,34-,35-,36+,37-,38-/m0/s1
n/an/an/an/a>1.00E+4n/an/an/an/a
University of Arizona
Curated by ChEMBL
Assay Description
Activity against hMC4R transfected in HEK293 cells by intracellular cAMP accumulation
J Med Chem 49: 1946-52 (2006)
Article DOI: 10.1021/jm0510326
BindingDB Entry DOI: 10.7270/Q2C24W1F
Melanocortin receptor 5 (MC5R)
(Homo sapiens (Human))
BDBM50184366
(CHEMBL203760 | c[Nle-Pro-D-Nal(2')-Arg-Trp-Glu]-NH...)
Show SMILES CCCC[C@@H]1NC(=O)CC[C@H](NC(=O)[C@H](Cc2c[nH]c3ccccc23)NC(=O)[C@H](CCCN=C(N)N)NC(=O)[C@@H](Cc2ccc3ccccc3c2)NC(=O)[C@@H]2CCCN2C1=O)C(N)=O |wU:10.66,39.41,wD:28.30,54.62,14.14,4.3,(-2.1,4.1,;-2.1,2.56,;-1.01,1.84,;-1.02,.32,;.21,-.38,;1.91,.24,;1.91,1.78,;.57,2.54,;3.12,2.56,;3.64,3.84,;5.16,4.05,;5.93,2.72,;6.69,1.39,;8.17,1.8,;7.09,-.09,;8.63,-.09,;9.4,-1.43,;9.39,-2.97,;10.85,-3.46,;11.76,-2.22,;13.28,-2.07,;13.92,-.67,;13.02,.59,;11.49,.43,;10.86,-.96,;6.15,-1.31,;6.74,-2.74,;8.28,-2.73,;6.33,-4.22,;7.42,-5.3,;8.91,-4.91,;10,-5.99,;11.48,-5.6,;12.57,-6.69,;14.06,-6.29,;12.17,-8.17,;4.99,-4.98,;3.66,-4.2,;3.67,-2.66,;2.33,-4.96,;2.32,-6.5,;3.65,-7.28,;4.98,-6.51,;6.31,-7.27,;6.31,-8.82,;7.64,-9.59,;7.64,-11.12,;6.3,-11.9,;4.97,-11.12,;4.98,-9.58,;3.65,-8.81,;.99,-4.19,;-.34,-4.96,;-.37,-6.5,;-1.87,-4,;-3.41,-4.17,;-4.04,-2.76,;-2.89,-1.72,;-1.56,-2.49,;-.13,-1.9,;1.09,-2.65,;5.94,5.38,;5.17,6.72,;7.48,5.38,)|
Show InChI InChI=1S/C46H59N11O7/c1-2-3-13-35-45(64)57-22-9-16-38(57)44(63)56-36(24-27-17-18-28-10-4-5-11-29(28)23-27)42(61)54-34(15-8-21-50-46(48)49)41(60)55-37(25-30-26-51-32-14-7-6-12-31(30)32)43(62)53-33(40(47)59)19-20-39(58)52-35/h4-7,10-12,14,17-18,23,26,33-38,51H,2-3,8-9,13,15-16,19-22,24-25H2,1H3,(H2,47,59)(H,52,58)(H,53,62)(H,54,61)(H,55,60)(H,56,63)(H4,48,49,50)/t33-,34-,35-,36+,37-,38-/m0/s1
n/an/an/an/a>1.00E+4n/an/an/an/a
University of Arizona
Curated by ChEMBL
Assay Description
Activity against hMC5R transfected in HEK293 cells by intracellular cAMP accumulation
J Med Chem 49: 1946-52 (2006)
Article DOI: 10.1021/jm0510326
BindingDB Entry DOI: 10.7270/Q2C24W1F
Melanocyte-stimulating hormone receptor
(Homo sapiens (Human))
BDBM50184366
(CHEMBL203760 | c[Nle-Pro-D-Nal(2')-Arg-Trp-Glu]-NH...)
Show SMILES CCCC[C@@H]1NC(=O)CC[C@H](NC(=O)[C@H](Cc2c[nH]c3ccccc23)NC(=O)[C@H](CCCN=C(N)N)NC(=O)[C@@H](Cc2ccc3ccccc3c2)NC(=O)[C@@H]2CCCN2C1=O)C(N)=O |wU:10.66,39.41,wD:28.30,54.62,14.14,4.3,(-2.1,4.1,;-2.1,2.56,;-1.01,1.84,;-1.02,.32,;.21,-.38,;1.91,.24,;1.91,1.78,;.57,2.54,;3.12,2.56,;3.64,3.84,;5.16,4.05,;5.93,2.72,;6.69,1.39,;8.17,1.8,;7.09,-.09,;8.63,-.09,;9.4,-1.43,;9.39,-2.97,;10.85,-3.46,;11.76,-2.22,;13.28,-2.07,;13.92,-.67,;13.02,.59,;11.49,.43,;10.86,-.96,;6.15,-1.31,;6.74,-2.74,;8.28,-2.73,;6.33,-4.22,;7.42,-5.3,;8.91,-4.91,;10,-5.99,;11.48,-5.6,;12.57,-6.69,;14.06,-6.29,;12.17,-8.17,;4.99,-4.98,;3.66,-4.2,;3.67,-2.66,;2.33,-4.96,;2.32,-6.5,;3.65,-7.28,;4.98,-6.51,;6.31,-7.27,;6.31,-8.82,;7.64,-9.59,;7.64,-11.12,;6.3,-11.9,;4.97,-11.12,;4.98,-9.58,;3.65,-8.81,;.99,-4.19,;-.34,-4.96,;-.37,-6.5,;-1.87,-4,;-3.41,-4.17,;-4.04,-2.76,;-2.89,-1.72,;-1.56,-2.49,;-.13,-1.9,;1.09,-2.65,;5.94,5.38,;5.17,6.72,;7.48,5.38,)|
Show InChI InChI=1S/C46H59N11O7/c1-2-3-13-35-45(64)57-22-9-16-38(57)44(63)56-36(24-27-17-18-28-10-4-5-11-29(28)23-27)42(61)54-34(15-8-21-50-46(48)49)41(60)55-37(25-30-26-51-32-14-7-6-12-31(30)32)43(62)53-33(40(47)59)19-20-39(58)52-35/h4-7,10-12,14,17-18,23,26,33-38,51H,2-3,8-9,13,15-16,19-22,24-25H2,1H3,(H2,47,59)(H,52,58)(H,53,62)(H,54,61)(H,55,60)(H,56,63)(H4,48,49,50)/t33-,34-,35-,36+,37-,38-/m0/s1
n/an/a>1.00E+4n/an/an/an/an/an/a
University of Arizona
Curated by ChEMBL
Assay Description
Inhibitory activity against hMC1R transfected in HEK293 cells
J Med Chem 49: 1946-52 (2006)
Article DOI: 10.1021/jm0510326
BindingDB Entry DOI: 10.7270/Q2C24W1F