BDBM50184404 (S)-(-)-10-{4-[2-(butoxy)ethoxy]phenyl}-1-propyl-N-(4-{[(1-propyl-1H-imidazol-5-yl)methyl]sulfinyl}phenyl)-1,2,3,4,5,6-hexahydro-1-benzazecine-7-carboxamide::CHEMBL202756
SMILES: CCCCOCCOc1ccc(cc1)-c1ccc2N(CCC)CCCCCC(=Cc2c1)C(=O)Nc1ccc(cc1)S(=O)Cc1cncn1CCC
InChI Key: InChIKey=UGKLSFKNMZXTGK-UHFFFAOYSA-N
Data: 1 IC50
Activity Spreadsheet -- Enzyme Inhibition Constant Data from BindingDB
Found 1 hit for monomerid = 50184404
Trg + Lig
Ki
nM
ΔG°
kcal/mole
IC50
nM
Kd
nM
EC50/IC50
nM
koff
s-1
kon
M-1s-1
pHTemp
°C
C-C chemokine receptor type 5
(Homo sapiens (Human))
BDBM50184404
((S)-(-)-10-{4-[2-(butoxy)ethoxy]phenyl}-1-propyl-N...)
Show SMILES CCCCOCCOc1ccc(cc1)-c1ccc2N(CCC)CCCCCC(=Cc2c1)C(=O)Nc1ccc(cc1)S(=O)Cc1cncn1CCC |w:28.29|
Show InChI InChI=1S/C42H54N4O4S/c1-4-7-25-49-26-27-50-39-17-12-33(13-18-39)34-14-21-41-36(28-34)29-35(11-9-8-10-24-45(41)22-5-2)42(47)44-37-15-19-40(20-16-37)51(48)31-38-30-43-32-46(38)23-6-3/h12-21,28-30,32H,4-11,22-27,31H2,1-3H3,(H,44,47)
n/an/a 25n/an/an/an/an/an/a
Takeda Pharmaceutical Company Limited
Curated by ChEMBL
Assay Description
Displacement of [125I]RANTES from CCR5 expressed in CHO cells
J Med Chem 49: 2037-48 (2006)
Article DOI: 10.1021/jm0509703
BindingDB Entry DOI: 10.7270/Q23N2303