BDBM50184492 5-(2-(pyridin-2-yl)-5,6-dihydro-4H-pyrrolo[1,2-b]pyrazol-3-yl)-1H-benzo[d]imidazole::CHEMBL204139
SMILES: C1Cc2c(c(nn2C1)-c1ccccn1)-c1ccc2nc[nH]c2c1
InChI Key: InChIKey=SVBDCIYLLHNPPR-UHFFFAOYSA-N
Data: 4 IC50
Activity Spreadsheet -- Enzyme Inhibition Constant Data from BindingDB
Found 4 hits for monomerid = 50184492
Trg + Lig
Ki
nM
ΔG°
kcal/mole
IC50
nM
Kd
nM
EC50/IC50
nM
koff
s-1
kon
M-1s-1
pHTemp
°C
TGF-beta receptor type-1
(Homo sapiens (Human))
BDBM50184492
(5-(2-(pyridin-2-yl)-5,6-dihydro-4H-pyrrolo[1,2-b]p...)
Show SMILES C1Cc2c(c(nn2C1)-c1ccccn1)-c1ccc2nc[nH]c2c1
Show InChI InChI=1S/C18H15N5/c1-2-8-19-14(4-1)18-17(16-5-3-9-23(16)22-18)12-6-7-13-15(10-12)21-11-20-13/h1-2,4,6-8,10-11H,3,5,9H2,(H,20,21)
n/an/a 1.70E+3n/an/an/an/an/an/a
Lilly Research Laboratory
Curated by ChEMBL
Assay Description
Inhibition of recombinant human TGFbeta R1 expressed in Sf9 cells
J Med Chem 49: 2138-42 (2006)
Article DOI: 10.1021/jm058209g
BindingDB Entry DOI: 10.7270/Q2V40TS0
TGF-beta receptor type-1
(Homo sapiens (Human))
BDBM50184492
(5-(2-(pyridin-2-yl)-5,6-dihydro-4H-pyrrolo[1,2-b]p...)
Show SMILES C1Cc2c(c(nn2C1)-c1ccccn1)-c1ccc2nc[nH]c2c1
Show InChI InChI=1S/C18H15N5/c1-2-8-19-14(4-1)18-17(16-5-3-9-23(16)22-18)12-6-7-13-15(10-12)21-11-20-13/h1-2,4,6-8,10-11H,3,5,9H2,(H,20,21)
n/an/a 422n/an/an/an/an/an/a
Lilly Research Laboratory
Curated by ChEMBL
Assay Description
Inhibition of TGFbeta R1 induced transcriptional activation of p3TP-Lux in mink Mv1Lu lung cells
J Med Chem 49: 2138-42 (2006)
Article DOI: 10.1021/jm058209g
BindingDB Entry DOI: 10.7270/Q2V40TS0
TGF-beta receptor type-2
(Homo sapiens (Human))
BDBM50184492
(5-(2-(pyridin-2-yl)-5,6-dihydro-4H-pyrrolo[1,2-b]p...)
Show SMILES C1Cc2c(c(nn2C1)-c1ccccn1)-c1ccc2nc[nH]c2c1
Show InChI InChI=1S/C18H15N5/c1-2-8-19-14(4-1)18-17(16-5-3-9-23(16)22-18)12-6-7-13-15(10-12)21-11-20-13/h1-2,4,6-8,10-11H,3,5,9H2,(H,20,21)
NCI pathway
Reactome pathway
n/an/a 8.73E+3n/an/an/an/an/an/a
Lilly Research Laboratory
Curated by ChEMBL
Assay Description
Inhibition of recombinant human TGFbeta R2 expressed in Sf9 cells
J Med Chem 49: 2138-42 (2006)
Article DOI: 10.1021/jm058209g
BindingDB Entry DOI: 10.7270/Q2V40TS0
Mitogen-activated protein kinase kinase kinase 20
(Homo sapiens (Human))
BDBM50184492
(5-(2-(pyridin-2-yl)-5,6-dihydro-4H-pyrrolo[1,2-b]p...)
Show SMILES C1Cc2c(c(nn2C1)-c1ccccn1)-c1ccc2nc[nH]c2c1
Show InChI InChI=1S/C18H15N5/c1-2-8-19-14(4-1)18-17(16-5-3-9-23(16)22-18)12-6-7-13-15(10-12)21-11-20-13/h1-2,4,6-8,10-11H,3,5,9H2,(H,20,21)
NCI pathway
n/an/a>2.00E+4n/an/an/an/an/an/a
Lilly Research Laboratory
Curated by ChEMBL
Assay Description
Inhibition of MLK7
J Med Chem 49: 2138-42 (2006)
Article DOI: 10.1021/jm058209g
BindingDB Entry DOI: 10.7270/Q2V40TS0