BDBM50184497 6-[2-(6-methyl-pyridin-2-yl)-5,6-dihydro-4H-pyrrolo[1,2-b]pyrazol-3-yl]-1-(3-pyrrolidin-1-yl-propyl)-1H-benzoimidazole::CHEMBL206233
SMILES: Cc1cccc(n1)-c1nn2CCCc2c1-c1ccc2ncn(CCCN3CCCC3)c2c1
InChI Key: InChIKey=BUPOPEPJCVXMNX-UHFFFAOYSA-N
Data: 4 IC50
Activity Spreadsheet -- Enzyme Inhibition Constant Data from BindingDB
Found 4 hits for monomerid = 50184497
Trg + Lig
Ki
nM
ΔG°
kcal/mole
IC50
nM
Kd
nM
EC50/IC50
nM
koff
s-1
kon
M-1s-1
pHTemp
°C
TGF-beta receptor type-1
(Homo sapiens (Human))
BDBM50184497
(6-[2-(6-methyl-pyridin-2-yl)-5,6-dihydro-4H-pyrrol...)
Show SMILES Cc1cccc(n1)-c1nn2CCCc2c1-c1ccc2ncn(CCCN3CCCC3)c2c1
Show InChI InChI=1S/C26H30N6/c1-19-7-4-8-22(28-19)26-25(23-9-5-16-32(23)29-26)20-10-11-21-24(17-20)31(18-27-21)15-6-14-30-12-2-3-13-30/h4,7-8,10-11,17-18H,2-3,5-6,9,12-16H2,1H3
n/an/a 74n/an/an/an/an/an/a
Lilly Research Laboratory
Curated by ChEMBL
Assay Description
Inhibition of recombinant human TGFbeta R1 expressed in Sf9 cells
J Med Chem 49: 2138-42 (2006)
Article DOI: 10.1021/jm058209g
BindingDB Entry DOI: 10.7270/Q2V40TS0
TGF-beta receptor type-2
(Homo sapiens (Human))
BDBM50184497
(6-[2-(6-methyl-pyridin-2-yl)-5,6-dihydro-4H-pyrrol...)
Show SMILES Cc1cccc(n1)-c1nn2CCCc2c1-c1ccc2ncn(CCCN3CCCC3)c2c1
Show InChI InChI=1S/C26H30N6/c1-19-7-4-8-22(28-19)26-25(23-9-5-16-32(23)29-26)20-10-11-21-24(17-20)31(18-27-21)15-6-14-30-12-2-3-13-30/h4,7-8,10-11,17-18H,2-3,5-6,9,12-16H2,1H3
NCI pathway
Reactome pathway
n/an/a>2.00E+4n/an/an/an/an/an/a
Lilly Research Laboratory
Curated by ChEMBL
Assay Description
Inhibition of recombinant human TGFbeta R2 expressed in Sf9 cells
J Med Chem 49: 2138-42 (2006)
Article DOI: 10.1021/jm058209g
BindingDB Entry DOI: 10.7270/Q2V40TS0
TGF-beta receptor type-1
(Homo sapiens (Human))
BDBM50184497
(6-[2-(6-methyl-pyridin-2-yl)-5,6-dihydro-4H-pyrrol...)
Show SMILES Cc1cccc(n1)-c1nn2CCCc2c1-c1ccc2ncn(CCCN3CCCC3)c2c1
Show InChI InChI=1S/C26H30N6/c1-19-7-4-8-22(28-19)26-25(23-9-5-16-32(23)29-26)20-10-11-21-24(17-20)31(18-27-21)15-6-14-30-12-2-3-13-30/h4,7-8,10-11,17-18H,2-3,5-6,9,12-16H2,1H3
n/an/a 117n/an/an/an/an/an/a
Lilly Research Laboratory
Curated by ChEMBL
Assay Description
Inhibition of TGFbeta R1 induced transcriptional activation of p3TP-Lux in mink Mv1Lu lung cells
J Med Chem 49: 2138-42 (2006)
Article DOI: 10.1021/jm058209g
BindingDB Entry DOI: 10.7270/Q2V40TS0
Mitogen-activated protein kinase kinase kinase 20
(Homo sapiens (Human))
BDBM50184497
(6-[2-(6-methyl-pyridin-2-yl)-5,6-dihydro-4H-pyrrol...)
Show SMILES Cc1cccc(n1)-c1nn2CCCc2c1-c1ccc2ncn(CCCN3CCCC3)c2c1
Show InChI InChI=1S/C26H30N6/c1-19-7-4-8-22(28-19)26-25(23-9-5-16-32(23)29-26)20-10-11-21-24(17-20)31(18-27-21)15-6-14-30-12-2-3-13-30/h4,7-8,10-11,17-18H,2-3,5-6,9,12-16H2,1H3
NCI pathway
n/an/a>2.00E+4n/an/an/an/an/an/a
Lilly Research Laboratory
Curated by ChEMBL
Assay Description
Inhibition of MLK7
J Med Chem 49: 2138-42 (2006)
Article DOI: 10.1021/jm058209g
BindingDB Entry DOI: 10.7270/Q2V40TS0