BDBM50184887 2-{4-[(2-chloroethyl)oxy]phenyl}-4-[3-(pyridin-2-yl)-1H-pyrazol-4-yl]pyridine::CHEMBL204575
SMILES: ClCCOc1ccc(cc1)-c1cc(ccn1)-c1c[nH]nc1-c1ccccn1
InChI Key: InChIKey=WMUUAGPFJLNYBE-UHFFFAOYSA-N
Data: 1 IC50
Activity Spreadsheet -- Enzyme Inhibition Constant Data from BindingDB
Found 1 hit for monomerid = 50184887
Trg + Lig
Ki
nM
ΔG°
kcal/mole
IC50
nM
Kd
nM
EC50/IC50
nM
koff
s-1
kon
M-1s-1
pHTemp
°C
TGF-beta receptor type-1
(Homo sapiens (Human))
BDBM50184887
(2-{4-[(2-chloroethyl)oxy]phenyl}-4-[3-(pyridin-2-y...)
Show SMILES ClCCOc1ccc(cc1)-c1cc(ccn1)-c1c[nH]nc1-c1ccccn1
Show InChI InChI=1S/C21H17ClN4O/c22-9-12-27-17-6-4-15(5-7-17)20-13-16(8-11-24-20)18-14-25-26-21(18)19-3-1-2-10-23-19/h1-8,10-11,13-14H,9,12H2,(H,25,26)
n/an/a 19n/an/an/an/an/an/a
GlaxoSmithKline
Curated by ChEMBL
Assay Description
Displacement of rhodamine green fluorescently labeled ATP from recombinant GST-ALK5 by FP assay
J Med Chem 49: 2210-21 (2006)
Article DOI: 10.1021/jm0509905
BindingDB Entry DOI: 10.7270/Q2DV1KPB