BDBM50184980 CHEMBL3824067
SMILES: CCN1CCN(CC1)\C=C1/CCn2c1nc(=O)c1c(Cl)cccc21
InChI Key: InChIKey=IOJASIOYJDJFSK-OUKQBFOZSA-N
Data: 1 Kd
Activity Spreadsheet -- Enzyme Inhibition Constant Data from BindingDB
Found 1 hit for monomerid = 50184980
Trg + Lig
Ki
nM
ΔG°
kcal/mole
IC50
nM
Kd
nM
EC50/IC50
nM
koff
s-1
kon
M-1s-1
pHTemp
°C
Protein polybromo-1
(Homo sapiens (Human))
BDBM50184980
(CHEMBL3824067)
Show SMILES CCN1CCN(CC1)\C=C1/CCn2c1nc(=O)c1c(Cl)cccc21
Show InChI InChI=1S/C18H21ClN4O/c1-2-21-8-10-22(11-9-21)12-13-6-7-23-15-5-3-4-14(19)16(15)18(24)20-17(13)23/h3-5,12H,2,6-11H2,1H3/b13-12+
n/an/an/a 142n/an/an/an/an/a
University of Cambridge
Curated by ChEMBL
Assay Description
Binding affinity to His6-tagged human recombinant PB1 bromodomain isoform 5 expressed in Escherichia coli BL21(DE3)-R3-pRARE2 cells by VP-ITC microca...
J Med Chem 59: 5095-101 (2016)
BindingDB Entry DOI: 10.7270/Q22R3TKH