BDBM50185122 3beta-acetoxyolean-12-en-27-oic acid::CHEMBL208639
SMILES: CC(=O)O[C@H]1CC[C@@]2(C)C(CC[C@]3(C)[C@@H]2CC=C2[C@@H]4CC(C)(C)CC[C@]4(C)CC[C@@]32C(O)=O)C1(C)C
InChI Key: InChIKey=IQYUEJTVDLHZDJ-PVLVPSCMSA-N
Data: 1 IC50
Activity Spreadsheet -- Enzyme Inhibition Constant Data from BindingDB
Found 1 hit for monomerid = 50185122
Trg + Lig
Ki
nM
ΔG°
kcal/mole
IC50
nM
Kd
nM
EC50/IC50
nM
koff
s-1
kon
M-1s-1
pHTemp
°C
Protein-tyrosine phosphatase 1B
(Homo sapiens (Human))
BDBM50185122
(3beta-acetoxyolean-12-en-27-oic acid | CHEMBL20863...)
Show SMILES CC(=O)O[C@H]1CC[C@@]2(C)C(CC[C@]3(C)[C@@H]2CC=C2[C@@H]4CC(C)(C)CC[C@]4(C)CC[C@@]32C(O)=O)C1(C)C |t:17|
Show InChI InChI=1S/C32H50O4/c1-20(33)36-25-12-13-30(7)23(28(25,4)5)11-14-31(8)24(30)10-9-21-22-19-27(2,3)15-16-29(22,6)17-18-32(21,31)26(34)35/h9,22-25H,10-19H2,1-8H3,(H,34,35)/t22-,23?,24+,25-,29+,30-,31+,32+/m0/s1
NCI pathway
Reactome pathway
n/an/a 8.50E+3n/an/an/an/an/an/a
Korea Research Institute of Bioscience and Biotechnology
Curated by ChEMBL
Assay Description
Inhibition of human recombinant PTP1B
Bioorg Med Chem Lett 16: 3273-6 (2006)
Article DOI: 10.1016/j.bmcl.2006.03.036
BindingDB Entry DOI: 10.7270/Q2ZP46WV