BDBM50185238 CHEMBL3823577
SMILES: COc1cc(ccc1Nc1ncc(C)c(Nc2ccccc2P(C)(C)=O)n1)N1CCC(CC1)N1CCN(C)CC1
InChI Key: InChIKey=ZTKZGNHMDMISHE-UHFFFAOYSA-N
Data: 3 IC50
Activity Spreadsheet -- Enzyme Inhibition Constant Data from BindingDB
Found 3 hits for monomerid = 50185238
Trg + Lig
Ki
nM
ΔG°
kcal/mole
IC50
nM
Kd
nM
EC50/IC50
nM
koff
s-1
kon
M-1s-1
pHTemp
°C
Insulin receptor
(Homo sapiens (Human))
BDBM50185238
(CHEMBL3823577)
Show SMILES COc1cc(ccc1Nc1ncc(C)c(Nc2ccccc2P(C)(C)=O)n1)N1CCC(CC1)N1CCN(C)CC1
Show InChI InChI=1S/C30H42N7O2P/c1-22-21-31-30(34-29(22)32-26-8-6-7-9-28(26)40(4,5)38)33-25-11-10-24(20-27(25)39-3)36-14-12-23(13-15-36)37-18-16-35(2)17-19-37/h6-11,20-21,23H,12-19H2,1-5H3,(H2,31,32,33,34)
n/an/a 483n/an/an/an/an/an/a
ARIAD Pharmaceuticals, Inc.
Curated by ChEMBL
Assay Description
Inhibition of human InsR using myelin basic protein as substrate and [gamma-33P]ATP measured after 1 hr
J Med Chem 59: 4948-64 (2016)
BindingDB Entry DOI: 10.7270/Q2NK3H0Q
ALK tyrosine kinase receptor
(Homo sapiens (Human))
BDBM50185238
(CHEMBL3823577)
Show SMILES COc1cc(ccc1Nc1ncc(C)c(Nc2ccccc2P(C)(C)=O)n1)N1CCC(CC1)N1CCN(C)CC1
Show InChI InChI=1S/C30H42N7O2P/c1-22-21-31-30(34-29(22)32-26-8-6-7-9-28(26)40(4,5)38)33-25-11-10-24(20-27(25)39-3)36-14-12-23(13-15-36)37-18-16-35(2)17-19-37/h6-11,20-21,23H,12-19H2,1-5H3,(H2,31,32,33,34)
n/an/a 0.420n/an/an/an/an/an/a
ARIAD Pharmaceuticals, Inc.
Curated by ChEMBL
Assay Description
Inhibition of human ALK using poly[Glu:Tyr] (4:1) as substrate and [gamma-33P]ATP measured after 1 hr
J Med Chem 59: 4948-64 (2016)
BindingDB Entry DOI: 10.7270/Q2NK3H0Q
Insulin-like growth factor I receptor
(Homo sapiens (Human))
BDBM50185238
(CHEMBL3823577)
Show SMILES COc1cc(ccc1Nc1ncc(C)c(Nc2ccccc2P(C)(C)=O)n1)N1CCC(CC1)N1CCN(C)CC1
Show InChI InChI=1S/C30H42N7O2P/c1-22-21-31-30(34-29(22)32-26-8-6-7-9-28(26)40(4,5)38)33-25-11-10-24(20-27(25)39-3)36-14-12-23(13-15-36)37-18-16-35(2)17-19-37/h6-11,20-21,23H,12-19H2,1-5H3,(H2,31,32,33,34)
Reactome pathway
n/an/a 128n/an/an/an/an/an/a
ARIAD Pharmaceuticals, Inc.
Curated by ChEMBL
Assay Description
Inhibition of human IGF1R using KKKSPGEYVNIEFG as substrate and [gamma-33P]ATP measured after 1 hr
J Med Chem 59: 4948-64 (2016)
BindingDB Entry DOI: 10.7270/Q2NK3H0Q