null
SMILES: COc1cc(ccc1Nc1ncc(Cl)c(Nc2ccccc2P(C)(C)=O)n1)P(C)(C)=O
InChI Key: InChIKey=SZCXARSUVUOVCP-UHFFFAOYSA-N
Activity Spreadsheet -- Enzyme Inhibition Constant Data from BindingDB
Found 3 hits for monomerid = 50185285
Trg + Lig
Ki
nM
ΔG°
kcal/mole
IC50
nM
Kd
nM
EC50/IC50
nM
koff
s-1
kon
M-1s-1
pHTemp
°C
Insulin receptor
(Homo sapiens (Human))
BDBM50185285
(CHEMBL3823165)
Show SMILES COc1cc(ccc1Nc1ncc(Cl)c(Nc2ccccc2P(C)(C)=O)n1)P(C)(C)=O
Show InChI InChI=1S/C21H25ClN4O3P2/c1-29-18-12-14(30(2,3)27)10-11-16(18)25-21-23-13-15(22)20(26-21)24-17-8-6-7-9-19(17)31(4,5)28/h6-13H,1-5H3,(H2,23,24,25,26)
n/an/a 726n/an/an/an/an/an/a
ARIAD Pharmaceuticals, Inc.
Curated by ChEMBL
Assay Description
Inhibition of human InsR using myelin basic protein as substrate and [gamma-33P]ATP measured after 1 hr
J Med Chem 59: 4948-64 (2016)
BindingDB Entry DOI: 10.7270/Q2NK3H0Q
ALK tyrosine kinase receptor
(Homo sapiens (Human))
BDBM50185285
(CHEMBL3823165)
Show SMILES COc1cc(ccc1Nc1ncc(Cl)c(Nc2ccccc2P(C)(C)=O)n1)P(C)(C)=O
Show InChI InChI=1S/C21H25ClN4O3P2/c1-29-18-12-14(30(2,3)27)10-11-16(18)25-21-23-13-15(22)20(26-21)24-17-8-6-7-9-19(17)31(4,5)28/h6-13H,1-5H3,(H2,23,24,25,26)
n/an/a 1.10n/an/an/an/an/an/a
ARIAD Pharmaceuticals, Inc.
Curated by ChEMBL
Assay Description
Inhibition of human ALK using poly[Glu:Tyr] (4:1) as substrate and [gamma-33P]ATP measured after 1 hr
J Med Chem 59: 4948-64 (2016)
BindingDB Entry DOI: 10.7270/Q2NK3H0Q
Insulin-like growth factor 1 receptor
(Homo sapiens (Human))
BDBM50185285
(CHEMBL3823165)
Show SMILES COc1cc(ccc1Nc1ncc(Cl)c(Nc2ccccc2P(C)(C)=O)n1)P(C)(C)=O
Show InChI InChI=1S/C21H25ClN4O3P2/c1-29-18-12-14(30(2,3)27)10-11-16(18)25-21-23-13-15(22)20(26-21)24-17-8-6-7-9-19(17)31(4,5)28/h6-13H,1-5H3,(H2,23,24,25,26)
Reactome pathway
n/an/a 139n/an/an/an/an/an/a
ARIAD Pharmaceuticals, Inc.
Curated by ChEMBL
Assay Description
Inhibition of human IGF1R using KKKSPGEYVNIEFG as substrate and [gamma-33P]ATP measured after 1 hr
J Med Chem 59: 4948-64 (2016)
BindingDB Entry DOI: 10.7270/Q2NK3H0Q