null
SMILES: COc1cc(ccc1Nc1ncc(Cl)c(Nc2ccccc2C(N)=O)n1)P(C)(C)=O
InChI Key: InChIKey=XRVFEWYOEIYZGB-UHFFFAOYSA-N
Activity Spreadsheet -- Enzyme Inhibition Constant Data from BindingDB
Found 3 hits for monomerid = 50185287
Trg + Lig
Ki
nM
ΔG°
kcal/mole
IC50
nM
Kd
nM
EC50/IC50
nM
koff
s-1
kon
M-1s-1
pHTemp
°C
Insulin receptor
(Homo sapiens (Human))
BDBM50185287
(CHEMBL3823268)
Show SMILES COc1cc(ccc1Nc1ncc(Cl)c(Nc2ccccc2C(N)=O)n1)P(C)(C)=O
Show InChI InChI=1S/C20H21ClN5O3P/c1-29-17-10-12(30(2,3)28)8-9-16(17)25-20-23-11-14(21)19(26-20)24-15-7-5-4-6-13(15)18(22)27/h4-11H,1-3H3,(H2,22,27)(H2,23,24,25,26)
n/an/a 14n/an/an/an/an/an/a
ARIAD Pharmaceuticals, Inc.
Curated by ChEMBL
Assay Description
Inhibition of human InsR using myelin basic protein as substrate and [gamma-33P]ATP measured after 1 hr
J Med Chem 59: 4948-64 (2016)
BindingDB Entry DOI: 10.7270/Q2NK3H0Q
ALK tyrosine kinase receptor
(Homo sapiens (Human))
BDBM50185287
(CHEMBL3823268)
Show SMILES COc1cc(ccc1Nc1ncc(Cl)c(Nc2ccccc2C(N)=O)n1)P(C)(C)=O
Show InChI InChI=1S/C20H21ClN5O3P/c1-29-17-10-12(30(2,3)28)8-9-16(17)25-20-23-11-14(21)19(26-20)24-15-7-5-4-6-13(15)18(22)27/h4-11H,1-3H3,(H2,22,27)(H2,23,24,25,26)
n/an/a 0.680n/an/an/an/an/an/a
ARIAD Pharmaceuticals, Inc.
Curated by ChEMBL
Assay Description
Inhibition of human ALK using poly[Glu:Tyr] (4:1) as substrate and [gamma-33P]ATP measured after 1 hr
J Med Chem 59: 4948-64 (2016)
BindingDB Entry DOI: 10.7270/Q2NK3H0Q
Insulin-like growth factor 1 receptor
(Homo sapiens (Human))
BDBM50185287
(CHEMBL3823268)
Show SMILES COc1cc(ccc1Nc1ncc(Cl)c(Nc2ccccc2C(N)=O)n1)P(C)(C)=O
Show InChI InChI=1S/C20H21ClN5O3P/c1-29-17-10-12(30(2,3)28)8-9-16(17)25-20-23-11-14(21)19(26-20)24-15-7-5-4-6-13(15)18(22)27/h4-11H,1-3H3,(H2,22,27)(H2,23,24,25,26)
Reactome pathway
n/an/a 0.110n/an/an/an/an/an/a
ARIAD Pharmaceuticals, Inc.
Curated by ChEMBL
Assay Description
Inhibition of human IGF1R using KKKSPGEYVNIEFG as substrate and [gamma-33P]ATP measured after 1 hr
J Med Chem 59: 4948-64 (2016)
BindingDB Entry DOI: 10.7270/Q2NK3H0Q