null
SMILES: OC(=O)CC(Cc1cc(OCCc2ccc3CCCNc3n2)n(Cc2ccccc2)n1)c1ccc2OCOc2c1
InChI Key: InChIKey=KRAZOLZZRSRPAE-UHFFFAOYSA-N
Activity Spreadsheet -- Enzyme Inhibition Constant Data from BindingDB
Found 5 hits for monomerid = 50185457
Trg + Lig
Ki
nM
ΔG°
kcal/mole
IC50
nM
Kd
nM
EC50/IC50
nM
koff
s-1
kon
M-1s-1
pHTemp
°C
Integrin alpha-V/beta-3
(Homo sapiens (Human))
BDBM50185457
(3-(benzo[d][1,3]dioxol-5-yl)-4-(1-benzyl-5-(2-(5,6...)
Show SMILES OC(=O)CC(Cc1cc(OCCc2ccc3CCCNc3n2)n(Cc2ccccc2)n1)c1ccc2OCOc2c1
Show InChI InChI=1S/C31H32N4O5/c36-30(37)17-24(23-9-11-27-28(16-23)40-20-39-27)15-26-18-29(35(34-26)19-21-5-2-1-3-6-21)38-14-12-25-10-8-22-7-4-13-32-31(22)33-25/h1-3,5-6,8-11,16,18,24H,4,7,12-15,17,19-20H2,(H,32,33)(H,36,37)
n/an/a 0.900n/an/an/an/an/an/a
Pfizer Inc.
Curated by ChEMBL
Assay Description
Inhibition of alphavbeta3 integrin in 293 cells
Bioorg Med Chem Lett 16: 3156-61 (2006)
Article DOI: 10.1016/j.bmcl.2006.03.045
BindingDB Entry DOI: 10.7270/Q29023CB
Integrin alpha-V/beta-5
(Homo sapiens (Human))
BDBM50185457
(3-(benzo[d][1,3]dioxol-5-yl)-4-(1-benzyl-5-(2-(5,6...)
Show SMILES OC(=O)CC(Cc1cc(OCCc2ccc3CCCNc3n2)n(Cc2ccccc2)n1)c1ccc2OCOc2c1
Show InChI InChI=1S/C31H32N4O5/c36-30(37)17-24(23-9-11-27-28(16-23)40-20-39-27)15-26-18-29(35(34-26)19-21-5-2-1-3-6-21)38-14-12-25-10-8-22-7-4-13-32-31(22)33-25/h1-3,5-6,8-11,16,18,24H,4,7,12-15,17,19-20H2,(H,32,33)(H,36,37)
NCI pathway
Reactome pathway
n/an/a 1.84n/an/an/an/an/an/a
Pfizer Inc.
Curated by ChEMBL
Assay Description
Inhibition of alphavbeta5 integrin in 293 cells
Bioorg Med Chem Lett 16: 3156-61 (2006)
Article DOI: 10.1016/j.bmcl.2006.03.045
BindingDB Entry DOI: 10.7270/Q29023CB
Integrin alpha-V/beta-6
(Homo sapiens (Human))
BDBM50185457
(3-(benzo[d][1,3]dioxol-5-yl)-4-(1-benzyl-5-(2-(5,6...)
Show SMILES OC(=O)CC(Cc1cc(OCCc2ccc3CCCNc3n2)n(Cc2ccccc2)n1)c1ccc2OCOc2c1
Show InChI InChI=1S/C31H32N4O5/c36-30(37)17-24(23-9-11-27-28(16-23)40-20-39-27)15-26-18-29(35(34-26)19-21-5-2-1-3-6-21)38-14-12-25-10-8-22-7-4-13-32-31(22)33-25/h1-3,5-6,8-11,16,18,24H,4,7,12-15,17,19-20H2,(H,32,33)(H,36,37)
n/an/a 2.11E+3n/an/an/an/an/an/a
Pfizer Inc.
Curated by ChEMBL
Assay Description
Inhibition of alphavbeta6 integrin in HT29 cells
Bioorg Med Chem Lett 16: 3156-61 (2006)
Article DOI: 10.1016/j.bmcl.2006.03.045
BindingDB Entry DOI: 10.7270/Q29023CB
Integrin alpha-V/beta-3
(Homo sapiens (Human))
BDBM50185457
(3-(benzo[d][1,3]dioxol-5-yl)-4-(1-benzyl-5-(2-(5,6...)
Show SMILES OC(=O)CC(Cc1cc(OCCc2ccc3CCCNc3n2)n(Cc2ccccc2)n1)c1ccc2OCOc2c1
Show InChI InChI=1S/C31H32N4O5/c36-30(37)17-24(23-9-11-27-28(16-23)40-20-39-27)15-26-18-29(35(34-26)19-21-5-2-1-3-6-21)38-14-12-25-10-8-22-7-4-13-32-31(22)33-25/h1-3,5-6,8-11,16,18,24H,4,7,12-15,17,19-20H2,(H,32,33)(H,36,37)
n/an/a 2.60n/an/an/an/an/an/a
Pfizer Inc.
Curated by ChEMBL
Assay Description
Inhibition of alphavbeta3 integrin by SPRA
Bioorg Med Chem Lett 16: 3156-61 (2006)
Article DOI: 10.1016/j.bmcl.2006.03.045
BindingDB Entry DOI: 10.7270/Q29023CB
Integrin alpha-IIb/beta-3
(Homo sapiens (Human))
BDBM50185457
(3-(benzo[d][1,3]dioxol-5-yl)-4-(1-benzyl-5-(2-(5,6...)
Show SMILES OC(=O)CC(Cc1cc(OCCc2ccc3CCCNc3n2)n(Cc2ccccc2)n1)c1ccc2OCOc2c1
Show InChI InChI=1S/C31H32N4O5/c36-30(37)17-24(23-9-11-27-28(16-23)40-20-39-27)15-26-18-29(35(34-26)19-21-5-2-1-3-6-21)38-14-12-25-10-8-22-7-4-13-32-31(22)33-25/h1-3,5-6,8-11,16,18,24H,4,7,12-15,17,19-20H2,(H,32,33)(H,36,37)
n/an/a 13.5n/an/an/an/an/an/a
Pfizer Inc.
Curated by ChEMBL
Assay Description
Inhibition of alpha2bbeta3 integrin by SPRA
Bioorg Med Chem Lett 16: 3156-61 (2006)
Article DOI: 10.1016/j.bmcl.2006.03.045
BindingDB Entry DOI: 10.7270/Q29023CB