null
SMILES: OCCn1nc(CC(CC(O)=O)c2ccc3OCOc3c2)cc1OCCc1ccc2CCCNc2n1
InChI Key: InChIKey=QFUAOXPDMSSGEO-UHFFFAOYSA-N
Activity Spreadsheet -- Enzyme Inhibition Constant Data from BindingDB
Found 2 hits for monomerid = 50185471
Trg + Lig
Ki
nM
ΔG°
kcal/mole
IC50
nM
Kd
nM
EC50/IC50
nM
koff
s-1
kon
M-1s-1
pHTemp
°C
Integrin alpha-V/beta-3
(Homo sapiens (Human))
BDBM50185471
(3-(benzo[d][1,3]dioxol-5-yl)-4-(1-(2-hydroxyethyl)...)
Show SMILES OCCn1nc(CC(CC(O)=O)c2ccc3OCOc3c2)cc1OCCc1ccc2CCCNc2n1
Show InChI InChI=1S/C26H30N4O6/c31-10-9-30-24(34-11-7-20-5-3-17-2-1-8-27-26(17)28-20)15-21(29-30)12-19(14-25(32)33)18-4-6-22-23(13-18)36-16-35-22/h3-6,13,15,19,31H,1-2,7-12,14,16H2,(H,27,28)(H,32,33)
n/an/a 1n/an/an/an/an/an/a
Pfizer Inc.
Curated by ChEMBL
Assay Description
Inhibition of alphavbeta3 integrin by SPRA
Bioorg Med Chem Lett 16: 3156-61 (2006)
Article DOI: 10.1016/j.bmcl.2006.03.045
BindingDB Entry DOI: 10.7270/Q29023CB
Integrin alpha-V/beta-6
(Homo sapiens (Human))
BDBM50185471
(3-(benzo[d][1,3]dioxol-5-yl)-4-(1-(2-hydroxyethyl)...)
Show SMILES OCCn1nc(CC(CC(O)=O)c2ccc3OCOc3c2)cc1OCCc1ccc2CCCNc2n1
Show InChI InChI=1S/C26H30N4O6/c31-10-9-30-24(34-11-7-20-5-3-17-2-1-8-27-26(17)28-20)15-21(29-30)12-19(14-25(32)33)18-4-6-22-23(13-18)36-16-35-22/h3-6,13,15,19,31H,1-2,7-12,14,16H2,(H,27,28)(H,32,33)
n/an/a 25.9n/an/an/an/an/an/a
Pfizer Inc.
Curated by ChEMBL
Assay Description
Inhibition of alphavbeta6 integrin in HT29 cells
Bioorg Med Chem Lett 16: 3156-61 (2006)
Article DOI: 10.1016/j.bmcl.2006.03.045
BindingDB Entry DOI: 10.7270/Q29023CB