BDBM50185668 (R)-N-ethyl-2-(4-(methylsulfonyl)phenyl)-N-(1-(3-(4-(methylsulfonyl)phenyl)-3-(3-(trifluoromethyl)phenyl)propyl)piperidin-4-yl)acetamide::CHEMBL377551
SMILES: CCN(C1CCN(CC[C@H](c2ccc(cc2)S(C)(=O)=O)c2cccc(c2)C(F)(F)F)CC1)C(=O)Cc1ccc(cc1)S(C)(=O)=O
InChI Key: InChIKey=QZVKMTXFSIOGOY-WJOKGBTCSA-N
Data: 1 IC50
Activity Spreadsheet -- Enzyme Inhibition Constant Data from BindingDB
Found 1 hit for monomerid = 50185668
Trg + Lig
Ki
nM
ΔG°
kcal/mole
IC50
nM
Kd
nM
EC50/IC50
nM
koff
s-1
kon
M-1s-1
pHTemp
°C
C-C chemokine receptor type 5
(Homo sapiens (Human))
BDBM50185668
((R)-N-ethyl-2-(4-(methylsulfonyl)phenyl)-N-(1-(3-(...)
Show SMILES CCN(C1CCN(CC[C@H](c2ccc(cc2)S(C)(=O)=O)c2cccc(c2)C(F)(F)F)CC1)C(=O)Cc1ccc(cc1)S(C)(=O)=O
Show InChI InChI=1S/C33H39F3N2O5S2/c1-4-38(32(39)22-24-8-12-29(13-9-24)44(2,40)41)28-16-19-37(20-17-28)21-18-31(25-10-14-30(15-11-25)45(3,42)43)26-6-5-7-27(23-26)33(34,35)36/h5-15,23,28,31H,4,16-22H2,1-3H3/t31-/m1/s1
n/an/a 20n/an/an/an/an/an/a
AstraZeneca
Curated by ChEMBL
Assay Description
Displacement of [125I]MIP-1alpha to human recombinant CCR5 expressed in CHO cells
Bioorg Med Chem Lett 16: 3533-6 (2006)
Article DOI: 10.1016/j.bmcl.2006.03.089
BindingDB Entry DOI: 10.7270/Q24B30XJ