null
SMILES: OC(=O)C(CCN1C(=O)c2ccccc2C1=O)Sc1ccc(cc1)C#Cc1ccc(Cl)cc1
InChI Key: InChIKey=XROIFKGGWPRMAM-UHFFFAOYSA-N
Activity Spreadsheet -- Enzyme Inhibition Constant Data from BindingDB
Found 2 hits for monomerid = 50185899
Trg + Lig
Ki
nM
ΔG°
kcal/mole
IC50
nM
Kd
nM
EC50/IC50
nM
koff
s-1
kon
M-1s-1
pHTemp
°C
72 kDa type IV collagenase
(Homo sapiens (Human))
BDBM50185899
(2-[4-(4-chloro-phenylethynyl)-phenylsulfanyl]-4-(1...)
Show SMILES OC(=O)C(CCN1C(=O)c2ccccc2C1=O)Sc1ccc(cc1)C#Cc1ccc(Cl)cc1
Show InChI InChI=1S/C26H18ClNO4S/c27-19-11-7-17(8-12-19)5-6-18-9-13-20(14-10-18)33-23(26(31)32)15-16-28-24(29)21-3-1-2-4-22(21)25(28)30/h1-4,7-14,23H,15-16H2,(H,31,32)
Reactome pathway
n/an/a 1.90n/an/an/an/an/an/a
Johnson & Johnson Pharmaceutical Research and Development
Curated by ChEMBL
Assay Description
Inhibition of MMP2
Bioorg Med Chem Lett 16: 3096-100 (2006)
Article DOI: 10.1016/j.bmcl.2006.03.065
BindingDB Entry DOI: 10.7270/Q2M90886
Matrix metalloproteinase-9
(Homo sapiens (Human))
BDBM50185899
(2-[4-(4-chloro-phenylethynyl)-phenylsulfanyl]-4-(1...)
Show SMILES OC(=O)C(CCN1C(=O)c2ccccc2C1=O)Sc1ccc(cc1)C#Cc1ccc(Cl)cc1
Show InChI InChI=1S/C26H18ClNO4S/c27-19-11-7-17(8-12-19)5-6-18-9-13-20(14-10-18)33-23(26(31)32)15-16-28-24(29)21-3-1-2-4-22(21)25(28)30/h1-4,7-14,23H,15-16H2,(H,31,32)
Reactome pathway
n/an/a 1.20n/an/an/an/an/an/a
Johnson & Johnson Pharmaceutical Research and Development
Curated by ChEMBL
Assay Description
Inhibition of MMP9
Bioorg Med Chem Lett 16: 3096-100 (2006)
Article DOI: 10.1016/j.bmcl.2006.03.065
BindingDB Entry DOI: 10.7270/Q2M90886