null
SMILES: CCN1CCC(CC1)(C(=O)NC1CCN(Cc2cccc(Oc3ccccc3OC)c2)CC1)c1ccccc1
InChI Key: InChIKey=OIZAFWVARZBXFK-UHFFFAOYSA-N
Activity Spreadsheet -- Enzyme Inhibition Constant Data from BindingDB
Found 3 hits for monomerid = 50185908
Trg + Lig
Ki
nM
ΔG°
kcal/mole
IC50
nM
Kd
nM
EC50/IC50
nM
koff
s-1
kon
M-1s-1
pHTemp
°C
C-C chemokine receptor type 8
(Homo sapiens (Human))
BDBM50185908
(1-ethyl-4-phenyl-piperidine-4-carboxylic acid {1-[...)
Show SMILES CCN1CCC(CC1)(C(=O)NC1CCN(Cc2cccc(Oc3ccccc3OC)c2)CC1)c1ccccc1
Show InChI InChI=1S/C33H41N3O3/c1-3-35-22-18-33(19-23-35,27-11-5-4-6-12-27)32(37)34-28-16-20-36(21-17-28)25-26-10-9-13-29(24-26)39-31-15-8-7-14-30(31)38-2/h4-15,24,28H,3,16-23,25H2,1-2H3,(H,34,37)
Reactome pathway
n/an/a 56n/an/an/an/an/an/a
Millennium Pharmaceuticals
Curated by ChEMBL
Assay Description
Inhibition of I309-induced chemotaxis in L1.2 cells expressing CCR8
J Med Chem 49: 2669-72 (2006)
Article DOI: 10.1021/jm050965z
BindingDB Entry DOI: 10.7270/Q2GH9HJX
Cytochrome P450 3A4
(Homo sapiens (Human))
BDBM50185908
(1-ethyl-4-phenyl-piperidine-4-carboxylic acid {1-[...)
Show SMILES CCN1CCC(CC1)(C(=O)NC1CCN(Cc2cccc(Oc3ccccc3OC)c2)CC1)c1ccccc1
Show InChI InChI=1S/C33H41N3O3/c1-3-35-22-18-33(19-23-35,27-11-5-4-6-12-27)32(37)34-28-16-20-36(21-17-28)25-26-10-9-13-29(24-26)39-31-15-8-7-14-30(31)38-2/h4-15,24,28H,3,16-23,25H2,1-2H3,(H,34,37)
Reactome pathway
n/an/a>1.00E+4n/an/an/an/an/an/a
Millennium Pharmaceuticals
Curated by ChEMBL
Assay Description
Inhibition of CYP3A4
J Med Chem 49: 2669-72 (2006)
Article DOI: 10.1021/jm050965z
BindingDB Entry DOI: 10.7270/Q2GH9HJX
C-C chemokine receptor type 8
(Homo sapiens (Human))
BDBM50185908
(1-ethyl-4-phenyl-piperidine-4-carboxylic acid {1-[...)
Show SMILES CCN1CCC(CC1)(C(=O)NC1CCN(Cc2cccc(Oc3ccccc3OC)c2)CC1)c1ccccc1
Show InChI InChI=1S/C33H41N3O3/c1-3-35-22-18-33(19-23-35,27-11-5-4-6-12-27)32(37)34-28-16-20-36(21-17-28)25-26-10-9-13-29(24-26)39-31-15-8-7-14-30(31)38-2/h4-15,24,28H,3,16-23,25H2,1-2H3,(H,34,37)
Reactome pathway
11n/an/an/an/an/an/an/an/a
Millennium Pharmaceuticals
Curated by ChEMBL
Assay Description
Displacement of [125I]I309 from human CCR8 expressed in L1.2 cells
J Med Chem 49: 2669-72 (2006)
Article DOI: 10.1021/jm050965z
BindingDB Entry DOI: 10.7270/Q2GH9HJX