BDBM50185916 1-(3-phenoxy-benzyl)-piperidine-4-carboxylic acid ethylamide::CHEMBL205304
SMILES: CCNC(=O)C1CCN(Cc2cccc(Oc3ccccc3)c2)CC1
InChI Key: InChIKey=YYYKGWKTHWSOEJ-UHFFFAOYSA-N
Data: 1 KI  1 IC50
Activity Spreadsheet -- Enzyme Inhibition Constant Data from BindingDB
Found 2 hits for monomerid = 50185916
Trg + Lig
Ki
nM
ΔG°
kcal/mole
IC50
nM
Kd
nM
EC50/IC50
nM
koff
s-1
kon
M-1s-1
pHTemp
°C
C-C chemokine receptor type 8
(Homo sapiens (Human))
BDBM50185916
(1-(3-phenoxy-benzyl)-piperidine-4-carboxylic acid ...)
Show SMILES CCNC(=O)C1CCN(Cc2cccc(Oc3ccccc3)c2)CC1
Show InChI InChI=1S/C21H26N2O2/c1-2-22-21(24)18-11-13-23(14-12-18)16-17-7-6-10-20(15-17)25-19-8-4-3-5-9-19/h3-10,15,18H,2,11-14,16H2,1H3,(H,22,24)
Reactome pathway
9.10E+3n/an/an/an/an/an/an/an/a
Millennium Pharmaceuticals
Curated by ChEMBL
Assay Description
Displacement of [125I]I309 from human CCR8 expressed in L1.2 cells
J Med Chem 49: 2669-72 (2006)
Article DOI: 10.1021/jm050965z
BindingDB Entry DOI: 10.7270/Q2GH9HJX
Cytochrome P450 3A4
(Homo sapiens (Human))
BDBM50185916
(1-(3-phenoxy-benzyl)-piperidine-4-carboxylic acid ...)
Show SMILES CCNC(=O)C1CCN(Cc2cccc(Oc3ccccc3)c2)CC1
Show InChI InChI=1S/C21H26N2O2/c1-2-22-21(24)18-11-13-23(14-12-18)16-17-7-6-10-20(15-17)25-19-8-4-3-5-9-19/h3-10,15,18H,2,11-14,16H2,1H3,(H,22,24)
Reactome pathway
n/an/a>1.00E+4n/an/an/an/an/an/a
Millennium Pharmaceuticals
Curated by ChEMBL
Assay Description
Inhibition of CYP3A4
J Med Chem 49: 2669-72 (2006)
Article DOI: 10.1021/jm050965z
BindingDB Entry DOI: 10.7270/Q2GH9HJX