null
SMILES: CC(=O)N1CCC(CC1)C(=O)N(CCCN1CCC(CC1)S(=O)(=O)c1ccc(F)cc1)c1ccc(Cl)c(Cl)c1
InChI Key: InChIKey=BQOSWZIEUSNZDS-UHFFFAOYSA-N
Activity Spreadsheet -- Enzyme Inhibition Constant Data from BindingDB
Found 2 hits for monomerid = 50185968
Trg + Lig
Ki
nM
ΔG°
kcal/mole
IC50
nM
Kd
nM
EC50/IC50
nM
koff
s-1
kon
M-1s-1
pHTemp
°C
C-C chemokine receptor type 5
(Homo sapiens (Human))
BDBM50185968
(1-acetyl-N-(3,4-dichlorophenyl)-N-(3-{4-[(4-fluoro...)
Show SMILES CC(=O)N1CCC(CC1)C(=O)N(CCCN1CCC(CC1)S(=O)(=O)c1ccc(F)cc1)c1ccc(Cl)c(Cl)c1
Show InChI InChI=1S/C28H34Cl2FN3O4S/c1-20(35)33-17-9-21(10-18-33)28(36)34(23-5-8-26(29)27(30)19-23)14-2-13-32-15-11-25(12-16-32)39(37,38)24-6-3-22(31)4-7-24/h3-8,19,21,25H,2,9-18H2,1H3
n/an/a 3.90n/an/an/an/an/an/a
Takeda Pharmaceutical Company Limited
Curated by ChEMBL
Assay Description
Inhibition of membrane fusion between HIV1 JR-FL Env-expressing COS7 cells and MOLT4/CCR5
J Med Chem 49: 2784-93 (2006)
Article DOI: 10.1021/jm051034q
BindingDB Entry DOI: 10.7270/Q2ZK5G8F
C-C chemokine receptor type 5
(Homo sapiens (Human))
BDBM50185968
(1-acetyl-N-(3,4-dichlorophenyl)-N-(3-{4-[(4-fluoro...)
Show SMILES CC(=O)N1CCC(CC1)C(=O)N(CCCN1CCC(CC1)S(=O)(=O)c1ccc(F)cc1)c1ccc(Cl)c(Cl)c1
Show InChI InChI=1S/C28H34Cl2FN3O4S/c1-20(35)33-17-9-21(10-18-33)28(36)34(23-5-8-26(29)27(30)19-23)14-2-13-32-15-11-25(12-16-32)39(37,38)24-6-3-22(31)4-7-24/h3-8,19,21,25H,2,9-18H2,1H3
n/an/a 2.90n/an/an/an/an/an/a
Takeda Pharmaceutical Company Limited
Curated by ChEMBL
Assay Description
Inhibition of [125I]RANTES binding to human CCR5 expressed in CHO cells
J Med Chem 49: 2784-93 (2006)
Article DOI: 10.1021/jm051034q
BindingDB Entry DOI: 10.7270/Q2ZK5G8F