BDBM50186084 CHEMBL210474::N-(2-(dimethylamino)ethyl)-8-ethyl-9-oxo-8,9-dihydrothiazolo[5,4-f]quinazoline-2-carboxamidine::N-(2-Dimethylamino-ethyl)-8-ethyl-9-oxo-8,9-dihydrothiazolo[5,4-f]quinazoline-2-carboxamidine
SMILES: CCn1cnc2ccc3nc(sc3c2c1=O)C(=N)NCCN(C)C
InChI Key: InChIKey=HGHNNYBSCFYUDU-UHFFFAOYSA-N
Data: 3 IC50
Activity Spreadsheet -- Enzyme Inhibition Constant Data from BindingDB
Found 3 hits for monomerid = 50186084
Trg + Lig
Ki
nM
ΔG°
kcal/mole
IC50
nM
Kd
nM
EC50/IC50
nM
koff
s-1
kon
M-1s-1
pHTemp
°C
Cyclin B/Cyclin-Dependent Kinase 1 (CDK1)/G2/mitotic-specific cyclin B2/G2/mitotic-specific cyclin B3
(Homo sapiens (Human))
BDBM50186084
(CHEMBL210474 | N-(2-(dimethylamino)ethyl)-8-ethyl-...)
Show SMILES CCn1cnc2ccc3nc(sc3c2c1=O)C(=N)NCCN(C)C
Show InChI InChI=1S/C16H20N6OS/c1-4-22-9-19-10-5-6-11-13(12(10)16(22)23)24-15(20-11)14(17)18-7-8-21(2)3/h5-6,9H,4,7-8H2,1-3H3,(H2,17,18)
n/an/a 1.70E+4n/an/an/an/an/an/a
Université de La Rochelle
Curated by ChEMBL
Assay Description
Inhibition of CDK1/cyclinB in presence of 15 uM ATP
Bioorg Med Chem Lett 16: 3419-23 (2006)
Article DOI: 10.1016/j.bmcl.2006.04.006
BindingDB Entry DOI: 10.7270/Q29W0F33
Glycogen synthase kinase-3
(Homo sapiens (Human))
BDBM50186084
(CHEMBL210474 | N-(2-(dimethylamino)ethyl)-8-ethyl-...)
Show SMILES CCn1cnc2ccc3nc(sc3c2c1=O)C(=N)NCCN(C)C
Show InChI InChI=1S/C16H20N6OS/c1-4-22-9-19-10-5-6-11-13(12(10)16(22)23)24-15(20-11)14(17)18-7-8-21(2)3/h5-6,9H,4,7-8H2,1-3H3,(H2,17,18)
NCI pathway
Reactome pathway
n/an/a 1.30E+3n/an/an/an/an/an/a
Université de Nantes
Curated by ChEMBL
Assay Description
Inhibition of GSK3alpha/beta (unknown origin)
Eur J Med Chem 43: 1469-77 (2008)
Article DOI: 10.1016/j.ejmech.2007.09.020
BindingDB Entry DOI: 10.7270/Q24M9495
Cyclin-dependent kinase 1
(Homo sapiens (Human))
BDBM50186084
(CHEMBL210474 | N-(2-(dimethylamino)ethyl)-8-ethyl-...)
Show SMILES CCn1cnc2ccc3nc(sc3c2c1=O)C(=N)NCCN(C)C
Show InChI InChI=1S/C16H20N6OS/c1-4-22-9-19-10-5-6-11-13(12(10)16(22)23)24-15(20-11)14(17)18-7-8-21(2)3/h5-6,9H,4,7-8H2,1-3H3,(H2,17,18)
Reactome pathway
n/an/a 1.70E+4n/an/an/an/an/an/a
Université de Nantes
Curated by ChEMBL
Assay Description
Inhibition of CDK1/cyclinB (unknown origin)
Eur J Med Chem 43: 1469-77 (2008)
Article DOI: 10.1016/j.ejmech.2007.09.020
BindingDB Entry DOI: 10.7270/Q24M9495