BDBM50186184 CHEMBL211336::propane-2-sulfonic acid {3-[4-hydroxy-1-(3-methyl-butyl)-2-oxo-1,2-dihydro-[1,8]naphthyridin-3-yl]-1,1-dioxo-1,4-dihydro-1lambda*6*-benzo[1,2,4]thiadiazin-7-yl}-amide::propane-2-sulfonic acid {3-[4-hydroxy-1-(3-methyl-butyl)-2-oxo-1,2-dihydro-quinolin-3-yl]-1,1-dioxo-1,4-dihydro-1lambda*6*-benzo[1,2,4]thiadiazin-7-yl}-amide
SMILES: CC(C)CCn1c2ncccc2c(O)c(C2=Nc3ccc(NS(=O)(=O)C(C)C)cc3S(=O)(=O)N2)c1=O
InChI Key: InChIKey=RVXAJFQEHULQHB-UHFFFAOYSA-N
Data: 2 IC50
Activity Spreadsheet -- Enzyme Inhibition Constant Data from BindingDB
Found 2 hits for monomerid = 50186184
Trg + Lig
Ki
nM
ΔG°
kcal/mole
IC50
nM
Kd
nM
EC50/IC50
nM
koff
s-1
kon
M-1s-1
pHTemp
°C
Hepatitis C virus NS5B RNA-dependent RNA polymerase
(Hepatitis C virus)
BDBM50186184
(CHEMBL211336 | propane-2-sulfonic acid {3-[4-hydro...)
Show SMILES CC(C)CCn1c2ncccc2c(O)c(C2=Nc3ccc(NS(=O)(=O)C(C)C)cc3S(=O)(=O)N2)c1=O |t:16|
Show InChI InChI=1S/C23H27N5O6S2/c1-13(2)9-11-28-22-16(6-5-10-24-22)20(29)19(23(28)30)21-25-17-8-7-15(26-35(31,32)14(3)4)12-18(17)36(33,34)27-21/h5-8,10,12-14,26,29H,9,11H2,1-4H3,(H,25,27)
n/an/a 8n/an/an/an/an/an/a
Abbott Laboratories
Curated by ChEMBL
Assay Description
Inhibition of HCV 1a NS5B RNA polymerase
Bioorg Med Chem Lett 16: 3833-8 (2006)
Article DOI: 10.1016/j.bmcl.2006.04.022
BindingDB Entry DOI: 10.7270/Q2J9660F
Hepatitis C virus NS5B RNA-dependent RNA polymerase
(Hepatitis C virus)
BDBM50186184
(CHEMBL211336 | propane-2-sulfonic acid {3-[4-hydro...)
Show SMILES CC(C)CCn1c2ncccc2c(O)c(C2=Nc3ccc(NS(=O)(=O)C(C)C)cc3S(=O)(=O)N2)c1=O |t:16|
Show InChI InChI=1S/C23H27N5O6S2/c1-13(2)9-11-28-22-16(6-5-10-24-22)20(29)19(23(28)30)21-25-17-8-7-15(26-35(31,32)14(3)4)12-18(17)36(33,34)27-21/h5-8,10,12-14,26,29H,9,11H2,1-4H3,(H,25,27)
n/an/a 3n/an/an/an/an/an/a
Abbott Laboratories
Curated by ChEMBL
Assay Description
Inhibition of HCV 1b NS5B RNA polymerase
Bioorg Med Chem Lett 16: 3833-8 (2006)
Article DOI: 10.1016/j.bmcl.2006.04.022
BindingDB Entry DOI: 10.7270/Q2J9660F