BDBM50186206 Bbutane-1-sulfonic acid {3-[4-hydroxy-1-(3-methyl-butyl)-2-oxo-1,2-dihydro-[1,8]naphthyridin-3-yl]-1,1-dioxo-1,4-dihydro-1lambda*6*-benzo[1,2,4]thiadiazin-7-yl}-amide::CHEMBL212355::butane-1-sulfonic acid {3-[4-hydroxy-1-(3-methyl-butyl)-2-oxo-1,2-dihydro-quinolin-3-yl]-1,1-dioxo-1,4-dihydro-1lambda*6*-benzo[1,2,4]thiadiazin-7-yl}-amide
SMILES: CCCCS(=O)(=O)Nc1ccc2N=C(NS(=O)(=O)c2c1)c1c(O)c2cccnc2n(CCC(C)C)c1=O
InChI Key: InChIKey=IVMICFCLQFAKKA-UHFFFAOYSA-N
Data: 2 IC50
Activity Spreadsheet -- Enzyme Inhibition Constant Data from BindingDB
Found 2 hits for monomerid = 50186206
Trg + Lig
Ki
nM
ΔG°
kcal/mole
IC50
nM
Kd
nM
EC50/IC50
nM
koff
s-1
kon
M-1s-1
pHTemp
°C
Hepatitis C virus NS5B RNA-dependent RNA polymerase
(Hepatitis C virus)
BDBM50186206
(Bbutane-1-sulfonic acid {3-[4-hydroxy-1-(3-methyl-...)
Show SMILES CCCCS(=O)(=O)Nc1ccc2N=C(NS(=O)(=O)c2c1)c1c(O)c2cccnc2n(CCC(C)C)c1=O |c:12|
Show InChI InChI=1S/C24H29N5O6S2/c1-4-5-13-36(32,33)27-16-8-9-18-19(14-16)37(34,35)28-22(26-18)20-21(30)17-7-6-11-25-23(17)29(24(20)31)12-10-15(2)3/h6-9,11,14-15,27,30H,4-5,10,12-13H2,1-3H3,(H,26,28)
n/an/a 5n/an/an/an/an/an/a
Abbott Laboratories
Curated by ChEMBL
Assay Description
Inhibition of HCV 1b NS5B RNA polymerase
Bioorg Med Chem Lett 16: 3833-8 (2006)
Article DOI: 10.1016/j.bmcl.2006.04.022
BindingDB Entry DOI: 10.7270/Q2J9660F
Hepatitis C virus NS5B RNA-dependent RNA polymerase
(Hepatitis C virus)
BDBM50186206
(Bbutane-1-sulfonic acid {3-[4-hydroxy-1-(3-methyl-...)
Show SMILES CCCCS(=O)(=O)Nc1ccc2N=C(NS(=O)(=O)c2c1)c1c(O)c2cccnc2n(CCC(C)C)c1=O |c:12|
Show InChI InChI=1S/C24H29N5O6S2/c1-4-5-13-36(32,33)27-16-8-9-18-19(14-16)37(34,35)28-22(26-18)20-21(30)17-7-6-11-25-23(17)29(24(20)31)12-10-15(2)3/h6-9,11,14-15,27,30H,4-5,10,12-13H2,1-3H3,(H,26,28)
n/an/a 22n/an/an/an/an/an/a
Abbott Laboratories
Curated by ChEMBL
Assay Description
Inhibition of HCV 1a NS5B RNA polymerase
Bioorg Med Chem Lett 16: 3833-8 (2006)
Article DOI: 10.1016/j.bmcl.2006.04.022
BindingDB Entry DOI: 10.7270/Q2J9660F