BDBM50186225 3-((3-(2-(2,3-dichloro-4-(2-methylenebutanoyl)phenoxy)acetamido)propanamido)methyl)-5-((3-(2-(2,3-dichloro-4-methacryloylphenoxy)acetamido)propanamido)methyl)benzamide::CHEMBL211727
SMILES: CCC(=C)C(=O)c1ccc(OCC(=O)NCCC(=O)NCc2cc(CNC(=O)CCNC(=O)COc3ccc(C(=O)C(C)=C)c(Cl)c3Cl)cc(c2)C(N)=O)c(Cl)c1Cl
InChI Key: InChIKey=MWHBQTGGDSVKIF-UHFFFAOYSA-N
Data: 2 IC50
Activity Spreadsheet -- Enzyme Inhibition Constant Data from BindingDB
Found 2 hits for monomerid = 50186225
Trg + Lig
Ki
nM
ΔG°
kcal/mole
IC50
nM
Kd
nM
EC50/IC50
nM
koff
s-1
kon
M-1s-1
pHTemp
°C
Glutathione S-transferase (GST)
(Homo sapiens (Human))
BDBM50186225
(3-((3-(2-(2,3-dichloro-4-(2-methylenebutanoyl)phen...)
Show SMILES CCC(=C)C(=O)c1ccc(OCC(=O)NCCC(=O)NCc2cc(CNC(=O)CCNC(=O)COc3ccc(C(=O)C(C)=C)c(Cl)c3Cl)cc(c2)C(N)=O)c(Cl)c1Cl
Show InChI InChI=1S/C40H41Cl4N5O9/c1-5-22(4)39(55)27-7-9-29(37(44)35(27)42)58-20-33(53)47-13-11-31(51)49-18-24-14-23(15-25(16-24)40(45)56)17-48-30(50)10-12-46-32(52)19-57-28-8-6-26(34(41)36(28)43)38(54)21(2)3/h6-9,14-16H,2,4-5,10-13,17-20H2,1,3H3,(H2,45,56)(H,46,52)(H,47,53)(H,48,50)(H,49,51)
n/an/a 13.7n/an/an/an/an/an/a
Syntrix Biosytems
Curated by ChEMBL
Assay Description
Inhibition of GST A1-1
Bioorg Med Chem Lett 16: 3780-3 (2006)
Article DOI: 10.1016/j.bmcl.2006.04.041
BindingDB Entry DOI: 10.7270/Q28W3CXV
Glutathione transferase (GST)
(Homo sapiens (Human))
BDBM50186225
(3-((3-(2-(2,3-dichloro-4-(2-methylenebutanoyl)phen...)
Show SMILES CCC(=C)C(=O)c1ccc(OCC(=O)NCCC(=O)NCc2cc(CNC(=O)CCNC(=O)COc3ccc(C(=O)C(C)=C)c(Cl)c3Cl)cc(c2)C(N)=O)c(Cl)c1Cl
Show InChI InChI=1S/C40H41Cl4N5O9/c1-5-22(4)39(55)27-7-9-29(37(44)35(27)42)58-20-33(53)47-13-11-31(51)49-18-24-14-23(15-25(16-24)40(45)56)17-48-30(50)10-12-46-32(52)19-57-28-8-6-26(34(41)36(28)43)38(54)21(2)3/h6-9,14-16H,2,4-5,10-13,17-20H2,1,3H3,(H2,45,56)(H,46,52)(H,47,53)(H,48,50)(H,49,51)
n/an/a 1.02E+3n/an/an/an/an/an/a
Syntrix Biosytems
Curated by ChEMBL
Assay Description
Inhibition of GST P1-1
Bioorg Med Chem Lett 16: 3780-3 (2006)
Article DOI: 10.1016/j.bmcl.2006.04.041
BindingDB Entry DOI: 10.7270/Q28W3CXV