BDBM50186456 CHEMBL211355::N-(5-(5-(1-acetylpiperazine-4-carbonyl)-4-hydroxy-2-methylphenylthio)thiazol-2-yl)-4-(dimethylamino)benzamide
SMILES: CN(C)c1ccc(cc1)C(=O)Nc1ncc(Sc2cc(C(=O)N3CCN(CC3)C(C)=O)c(O)cc2C)s1
InChI Key: InChIKey=CYENRWZQGSRRDN-UHFFFAOYSA-N
Data: 1 IC50
Activity Spreadsheet -- Enzyme Inhibition Constant Data from BindingDB
Found 1 hit for monomerid = 50186456
Trg + Lig
Ki
nM
ΔG°
kcal/mole
IC50
nM
Kd
nM
EC50/IC50
nM
koff
s-1
kon
M-1s-1
pHTemp
°C
Tyrosine-protein kinase ITK/TSK
(Homo sapiens (Human))
BDBM50186456
(CHEMBL211355 | N-(5-(5-(1-acetylpiperazine-4-carbo...)
Show SMILES CN(C)c1ccc(cc1)C(=O)Nc1ncc(Sc2cc(C(=O)N3CCN(CC3)C(C)=O)c(O)cc2C)s1
Show InChI InChI=1S/C26H29N5O4S2/c1-16-13-21(33)20(25(35)31-11-9-30(10-12-31)17(2)32)14-22(16)36-23-15-27-26(37-23)28-24(34)18-5-7-19(8-6-18)29(3)4/h5-8,13-15,33H,9-12H2,1-4H3,(H,27,28,34)
Reactome pathway
n/an/a 12n/an/an/an/an/an/a
Bristol-Myers Squibb Pharmaceutical Research Institute
Curated by ChEMBL
Assay Description
Inhibition of Itk
Bioorg Med Chem Lett 16: 3706-12 (2006)
Article DOI: 10.1016/j.bmcl.2006.04.060
BindingDB Entry DOI: 10.7270/Q20C4VBR