BDBM50186458 CHEMBL273966::N-(5-(3-(1-acetylpiperazine-4-carbonyl)benzyl)thiazol-2-yl)-4-(dimethylamino)benzamide
SMILES: CN(C)c1ccc(cc1)C(=O)Nc1ncc(Cc2cccc(c2)C(=O)N2CCN(CC2)C(C)=O)s1
InChI Key: InChIKey=ZJRLORBIIUEFCY-UHFFFAOYSA-N
Data: 1 IC50
Activity Spreadsheet -- Enzyme Inhibition Constant Data from BindingDB
Found 1 hit for monomerid = 50186458
Trg + Lig
Ki
nM
ΔG°
kcal/mole
IC50
nM
Kd
nM
EC50/IC50
nM
koff
s-1
kon
M-1s-1
pHTemp
°C
Tyrosine-protein kinase ITK/TSK
(Homo sapiens (Human))
BDBM50186458
(CHEMBL273966 | N-(5-(3-(1-acetylpiperazine-4-carbo...)
Show SMILES CN(C)c1ccc(cc1)C(=O)Nc1ncc(Cc2cccc(c2)C(=O)N2CCN(CC2)C(C)=O)s1
Show InChI InChI=1S/C26H29N5O3S/c1-18(32)30-11-13-31(14-12-30)25(34)21-6-4-5-19(15-21)16-23-17-27-26(35-23)28-24(33)20-7-9-22(10-8-20)29(2)3/h4-10,15,17H,11-14,16H2,1-3H3,(H,27,28,33)
Reactome pathway
n/an/a 820n/an/an/an/an/an/a
Bristol-Myers Squibb Pharmaceutical Research Institute
Curated by ChEMBL
Assay Description
Inhibition of Itk
Bioorg Med Chem Lett 16: 3706-12 (2006)
Article DOI: 10.1016/j.bmcl.2006.04.060
BindingDB Entry DOI: 10.7270/Q20C4VBR