BDBM50186496 CHEMBL210985::N-(5-(5-(1-acetylpiperazine-4-carbonyl)-4-methoxy-2-methylphenylthio)thiazol-2-yl)-4-((ethylamino)methyl)benzamide
SMILES: CCNCc1ccc(cc1)C(=O)Nc1ncc(Sc2cc(C(=O)N3CCN(CC3)C(C)=O)c(OC)cc2C)s1
InChI Key: InChIKey=OQNIMKVDOJIQID-UHFFFAOYSA-N
Data: 1 IC50
Activity Spreadsheet -- Enzyme Inhibition Constant Data from BindingDB
Found 1 hit for monomerid = 50186496
Trg + Lig
Ki
nM
ΔG°
kcal/mole
IC50
nM
Kd
nM
EC50/IC50
nM
koff
s-1
kon
M-1s-1
pHTemp
°C
Tyrosine-protein kinase ITK/TSK
(Homo sapiens (Human))
BDBM50186496
(CHEMBL210985 | N-(5-(5-(1-acetylpiperazine-4-carbo...)
Show SMILES CCNCc1ccc(cc1)C(=O)Nc1ncc(Sc2cc(C(=O)N3CCN(CC3)C(C)=O)c(OC)cc2C)s1
Show InChI InChI=1S/C28H33N5O4S2/c1-5-29-16-20-6-8-21(9-7-20)26(35)31-28-30-17-25(39-28)38-24-15-22(23(37-4)14-18(24)2)27(36)33-12-10-32(11-13-33)19(3)34/h6-9,14-15,17,29H,5,10-13,16H2,1-4H3,(H,30,31,35)
Reactome pathway
n/an/a 29n/an/an/an/an/an/a
Bristol-Myers Squibb Pharmaceutical Research Institute
Curated by ChEMBL
Assay Description
Inhibition of Itk
Bioorg Med Chem Lett 16: 3706-12 (2006)
Article DOI: 10.1016/j.bmcl.2006.04.060
BindingDB Entry DOI: 10.7270/Q20C4VBR