BDBM50186614 3-amino-5-(4-methoxyphenyl)thiophene-2-carboxamide::CHEMBL443571
SMILES: COc1ccc(cc1)-c1cc(N)c(s1)C(N)=O
InChI Key: InChIKey=OEUITKOCUWEFOB-UHFFFAOYSA-N
Data: 1 IC50
Activity Spreadsheet -- Enzyme Inhibition Constant Data from BindingDB
Found 1 hit for monomerid = 50186614
Trg + Lig
Ki
nM
ΔG°
kcal/mole
IC50
nM
Kd
nM
EC50/IC50
nM
koff
s-1
kon
M-1s-1
pHTemp
°C
Inhibitor of nuclear factor kappa-B kinase subunit beta
(Homo sapiens (Human))
BDBM50186614
(3-amino-5-(4-methoxyphenyl)thiophene-2-carboxamide...)
Show SMILES COc1ccc(cc1)-c1cc(N)c(s1)C(N)=O
Show InChI InChI=1S/C12H12N2O2S/c1-16-8-4-2-7(3-5-8)10-6-9(13)11(17-10)12(14)15/h2-6H,13H2,1H3,(H2,14,15)
NCI pathway
Reactome pathway
n/an/a 2.90E+3n/an/an/an/an/an/a
Boehringer Ingelheim Pharmaceuticals
Curated by ChEMBL
Assay Description
Inhibition of IKK beta
J Med Chem 49: 2898-908 (2006)
Article DOI: 10.1021/jm0510979
BindingDB Entry DOI: 10.7270/Q2TQ614S