null
SMILES: NC(=O)c1cc(sc1N)-c1ccccc1
InChI Key: InChIKey=UHEGYTDIDBFUJD-UHFFFAOYSA-N
Activity Spreadsheet -- Enzyme Inhibition Constant Data from BindingDB
Found 1 hit for monomerid = 50186655
Trg + Lig
Ki
nM
ΔG°
kcal/mole
IC50
nM
Kd
nM
EC50/IC50
nM
koff
s-1
kon
M-1s-1
pHTemp
°C
Inhibitor of nuclear factor kappa-B kinase subunit beta
(Homo sapiens (Human))
BDBM50186655
(2-amino-5-phenylthiophene-3-carboxamide | CHEMBL38...)
Show SMILES NC(=O)c1cc(sc1N)-c1ccccc1
Show InChI InChI=1S/C11H10N2OS/c12-10(14)8-6-9(15-11(8)13)7-4-2-1-3-5-7/h1-6H,13H2,(H2,12,14)
NCI pathway
Reactome pathway
n/an/a 1.90E+3n/an/an/an/an/an/a
Boehringer Ingelheim Pharmaceuticals
Curated by ChEMBL
Assay Description
Inhibition of IKK beta
J Med Chem 49: 2898-908 (2006)
Article DOI: 10.1021/jm0510979
BindingDB Entry DOI: 10.7270/Q2TQ614S