BDBM50186921 3-(4-(5-(4-isopropoxy-3-methylphenyl)-1,2,4-oxadiazol-3-yl)-3-methylphenyl)propanoic acid::CHEMBL208898
SMILES: CC(C)Oc1ccc(cc1C)-c1nc(no1)-c1ccc(CCC(O)=O)cc1C
InChI Key: InChIKey=HTFJTFNEBQAXGE-UHFFFAOYSA-N
Data: 5 EC50
Activity Spreadsheet -- Enzyme Inhibition Constant Data from BindingDB
Found 5 hits for monomerid = 50186921
Trg + Lig
Ki
nM
ΔG°
kcal/mole
IC50
nM
Kd
nM
EC50/IC50
nM
koff
s-1
kon
M-1s-1
pHTemp
°C
Sphingosine 1-phosphate receptor 1
(Homo sapiens (Human))
BDBM50186921
(3-(4-(5-(4-isopropoxy-3-methylphenyl)-1,2,4-oxadia...)
Show SMILES CC(C)Oc1ccc(cc1C)-c1nc(no1)-c1ccc(CCC(O)=O)cc1C
Show InChI InChI=1S/C22H24N2O4/c1-13(2)27-19-9-7-17(12-15(19)4)22-23-21(24-28-22)18-8-5-16(11-14(18)3)6-10-20(25)26/h5,7-9,11-13H,6,10H2,1-4H3,(H,25,26)
Reactome pathway
n/an/an/an/a 0.200n/an/an/an/a
Merck Research Laboratories
Curated by ChEMBL
Assay Description
Agonist activity at S1P1 receptor expressed in CHO cells measured as S1P-induced [35S]GTPgammaS uptake
Bioorg Med Chem Lett 16: 3679-83 (2006)
Article DOI: 10.1016/j.bmcl.2006.04.084
BindingDB Entry DOI: 10.7270/Q2J67GJ8
Sphingosine 1-phosphate receptor 4
(Homo sapiens (Human))
BDBM50186921
(3-(4-(5-(4-isopropoxy-3-methylphenyl)-1,2,4-oxadia...)
Show SMILES CC(C)Oc1ccc(cc1C)-c1nc(no1)-c1ccc(CCC(O)=O)cc1C
Show InChI InChI=1S/C22H24N2O4/c1-13(2)27-19-9-7-17(12-15(19)4)22-23-21(24-28-22)18-8-5-16(11-14(18)3)6-10-20(25)26/h5,7-9,11-13H,6,10H2,1-4H3,(H,25,26)
NCI pathway
Reactome pathway
n/an/an/an/a>1.00E+4n/an/an/an/a
Merck Research Laboratories
Curated by ChEMBL
Assay Description
Activity at S1P4 receptor expressed in CHO cells measured as S1P-induced [35S]GTPgammaS uptake
Bioorg Med Chem Lett 16: 3679-83 (2006)
Article DOI: 10.1016/j.bmcl.2006.04.084
BindingDB Entry DOI: 10.7270/Q2J67GJ8
Sphingosine 1-phosphate receptor 5
(Homo sapiens (Human))
BDBM50186921
(3-(4-(5-(4-isopropoxy-3-methylphenyl)-1,2,4-oxadia...)
Show SMILES CC(C)Oc1ccc(cc1C)-c1nc(no1)-c1ccc(CCC(O)=O)cc1C
Show InChI InChI=1S/C22H24N2O4/c1-13(2)27-19-9-7-17(12-15(19)4)22-23-21(24-28-22)18-8-5-16(11-14(18)3)6-10-20(25)26/h5,7-9,11-13H,6,10H2,1-4H3,(H,25,26)
NCI pathway
Reactome pathway
n/an/an/an/a 210n/an/an/an/a
Merck Research Laboratories
Curated by ChEMBL
Assay Description
Agonist activity at S1P5 receptor expressed in CHO cells measured as S1P-induced [35S]GTPgammaS uptake
Bioorg Med Chem Lett 16: 3679-83 (2006)
Article DOI: 10.1016/j.bmcl.2006.04.084
BindingDB Entry DOI: 10.7270/Q2J67GJ8
Sphingosine 1-phosphate receptor 3
(Homo sapiens (Human))
BDBM50186921
(3-(4-(5-(4-isopropoxy-3-methylphenyl)-1,2,4-oxadia...)
Show SMILES CC(C)Oc1ccc(cc1C)-c1nc(no1)-c1ccc(CCC(O)=O)cc1C
Show InChI InChI=1S/C22H24N2O4/c1-13(2)27-19-9-7-17(12-15(19)4)22-23-21(24-28-22)18-8-5-16(11-14(18)3)6-10-20(25)26/h5,7-9,11-13H,6,10H2,1-4H3,(H,25,26)
NCI pathway
Reactome pathway
n/an/an/an/a 460n/an/an/an/a
Merck Research Laboratories
Curated by ChEMBL
Assay Description
Agonist activity at S1P3 receptor expressed in CHO cells measured as S1P-induced [35S]GTPgammaS uptake
Bioorg Med Chem Lett 16: 3679-83 (2006)
Article DOI: 10.1016/j.bmcl.2006.04.084
BindingDB Entry DOI: 10.7270/Q2J67GJ8
Sphingosine 1-phosphate receptor 2
(Homo sapiens (Human))
BDBM50186921
(3-(4-(5-(4-isopropoxy-3-methylphenyl)-1,2,4-oxadia...)
Show SMILES CC(C)Oc1ccc(cc1C)-c1nc(no1)-c1ccc(CCC(O)=O)cc1C
Show InChI InChI=1S/C22H24N2O4/c1-13(2)27-19-9-7-17(12-15(19)4)22-23-21(24-28-22)18-8-5-16(11-14(18)3)6-10-20(25)26/h5,7-9,11-13H,6,10H2,1-4H3,(H,25,26)
NCI pathway
Reactome pathway
n/an/an/an/a>1.00E+4n/an/an/an/a
Merck Research Laboratories
Curated by ChEMBL
Assay Description
Activity at S1P2 receptor expressed in CHO cells measured as S1P-induced [35S]GTPgammaS uptake
Bioorg Med Chem Lett 16: 3679-83 (2006)
Article DOI: 10.1016/j.bmcl.2006.04.084
BindingDB Entry DOI: 10.7270/Q2J67GJ8