null
SMILES: CC(C)c1c(NC(=O)Nc2ccc(Cl)cc2)c(=O)n(-c2cncnc2)n1C
InChI Key: InChIKey=GVCCGTSQZAHGFP-UHFFFAOYSA-N
Activity Spreadsheet -- Enzyme Inhibition Constant Data from BindingDB
Found 1 hit for monomerid = 50186939
Trg + Lig
Ki
nM
ΔG°
kcal/mole
IC50
nM
Kd
nM
EC50/IC50
nM
koff
s-1
kon
M-1s-1
pHTemp
°C
N-formyl peptide receptor 2
(Homo sapiens (Human))
BDBM50186939
(1-(4-chlorophenyl)-3-(3-isopropyl-2-methyl-5-oxo-1...)
Show SMILES CC(C)c1c(NC(=O)Nc2ccc(Cl)cc2)c(=O)n(-c2cncnc2)n1C
Show InChI InChI=1S/C18H19ClN6O2/c1-11(2)16-15(23-18(27)22-13-6-4-12(19)5-7-13)17(26)25(24(16)3)14-8-20-10-21-9-14/h4-11H,1-3H3,(H2,22,23,27)
NCI pathway
Reactome pathway
n/an/an/an/a 250n/an/an/an/a
Amgen, Inc.
Curated by ChEMBL
Assay Description
Activity at human FPRL1-mediated calcium mobilization in CHO cells
Bioorg Med Chem Lett 16: 3713-8 (2006)
Article DOI: 10.1016/j.bmcl.2006.04.068
BindingDB Entry DOI: 10.7270/Q2DF6QTJ