BDBM50186945 1-(3-ethyl-2-methyl-5-oxo-1-phenyl-2,5-dihydro-1H-pyrazol-4-yl)-3-(3-fluoro-4-methylphenyl)urea::CHEMBL212113
SMILES: CCc1c(NC(=O)Nc2ccc(C)c(F)c2)c(=O)n(-c2ccccc2)n1C
InChI Key: InChIKey=CMJJSFWJYMUEIL-UHFFFAOYSA-N
Data: 1 EC50
Activity Spreadsheet -- Enzyme Inhibition Constant Data from BindingDB
Found 1 hit for monomerid = 50186945
Trg + Lig
Ki
nM
ΔG°
kcal/mole
IC50
nM
Kd
nM
EC50/IC50
nM
koff
s-1
kon
M-1s-1
pHTemp
°C
N-formyl peptide receptor 2
(Homo sapiens (Human))
BDBM50186945
(1-(3-ethyl-2-methyl-5-oxo-1-phenyl-2,5-dihydro-1H-...)
Show SMILES CCc1c(NC(=O)Nc2ccc(C)c(F)c2)c(=O)n(-c2ccccc2)n1C
Show InChI InChI=1S/C20H21FN4O2/c1-4-17-18(19(26)25(24(17)3)15-8-6-5-7-9-15)23-20(27)22-14-11-10-13(2)16(21)12-14/h5-12H,4H2,1-3H3,(H2,22,23,27)
NCI pathway
Reactome pathway
n/an/an/an/a 310n/an/an/an/a
Amgen, Inc.
Curated by ChEMBL
Assay Description
Activity at human FPRL1-mediated calcium mobilization in CHO cells
Bioorg Med Chem Lett 16: 3713-8 (2006)
Article DOI: 10.1016/j.bmcl.2006.04.068
BindingDB Entry DOI: 10.7270/Q2DF6QTJ