BDBM50186946 1-(1,5-dimethyl-3-oxo-2-phenylpyrazolidin-4-yl)-3-(4-iodophenyl)-1,3-dimethylurea::CHEMBL208831
SMILES: CC1C(N(C)C(=O)N(C)c2ccc(I)cc2)C(=O)N(N1C)c1ccccc1
InChI Key: InChIKey=FDOSFXRABIYUOG-UHFFFAOYSA-N
Data: 1 EC50
Activity Spreadsheet -- Enzyme Inhibition Constant Data from BindingDB
Found 1 hit for monomerid = 50186946
Trg + Lig
Ki
nM
ΔG°
kcal/mole
IC50
nM
Kd
nM
EC50/IC50
nM
koff
s-1
kon
M-1s-1
pHTemp
°C
N-formyl peptide receptor 2
(Homo sapiens (Human))
BDBM50186946
(1-(1,5-dimethyl-3-oxo-2-phenylpyrazolidin-4-yl)-3-...)
Show SMILES CC1C(N(C)C(=O)N(C)c2ccc(I)cc2)C(=O)N(N1C)c1ccccc1
Show InChI InChI=1S/C20H23IN4O2/c1-14-18(19(26)25(24(14)4)17-8-6-5-7-9-17)23(3)20(27)22(2)16-12-10-15(21)11-13-16/h5-14,18H,1-4H3
NCI pathway
Reactome pathway
n/an/an/an/a>1.00E+4n/an/an/an/a
Amgen, Inc.
Curated by ChEMBL
Assay Description
Activity at human FPRL1-mediated calcium mobilization in CHO cells
Bioorg Med Chem Lett 16: 3713-8 (2006)
Article DOI: 10.1016/j.bmcl.2006.04.068
BindingDB Entry DOI: 10.7270/Q2DF6QTJ