BDBM50186954 1-(4-chlorophenyl)-3-(3-ethyl-2-methyl-5-oxo-1-phenyl-2,5-dihydro-1H-pyrazol-4-yl)urea::CHEMBL209995
SMILES: CCc1c(NC(=O)Nc2ccc(Cl)cc2)c(=O)n(-c2ccccc2)n1C
InChI Key: InChIKey=WDFOVPXHJZRBDV-UHFFFAOYSA-N
Data: 1 EC50
Activity Spreadsheet -- Enzyme Inhibition Constant Data from BindingDB
Found 1 hit for monomerid = 50186954
Trg + Lig
Ki
nM
ΔG°
kcal/mole
IC50
nM
Kd
nM
EC50/IC50
nM
koff
s-1
kon
M-1s-1
pHTemp
°C
N-formyl peptide receptor 2
(Homo sapiens (Human))
BDBM50186954
(1-(4-chlorophenyl)-3-(3-ethyl-2-methyl-5-oxo-1-phe...)
Show SMILES CCc1c(NC(=O)Nc2ccc(Cl)cc2)c(=O)n(-c2ccccc2)n1C
Show InChI InChI=1S/C19H19ClN4O2/c1-3-16-17(22-19(26)21-14-11-9-13(20)10-12-14)18(25)24(23(16)2)15-7-5-4-6-8-15/h4-12H,3H2,1-2H3,(H2,21,22,26)
NCI pathway
Reactome pathway
n/an/an/an/a 140n/an/an/an/a
Amgen, Inc.
Curated by ChEMBL
Assay Description
Activity at human FPRL1-mediated calcium mobilization in CHO cells
Bioorg Med Chem Lett 16: 3713-8 (2006)
Article DOI: 10.1016/j.bmcl.2006.04.068
BindingDB Entry DOI: 10.7270/Q2DF6QTJ